f



Error (ADE-3036)

Hi, i was trying to run a simple test on a delay cell for the first time in=
 virtuoso. I am getting the following error during Netlist and Run:
=20

ERROR (ADE-3036): Errors encountered during simulation. The simulator run l=
og has not been generated.
        Possible cause could be an invalid command line option for the vers=
ion of the simulator
        you are running. Choose Setup->Environment and verify that the comm=
and line options
        specified in the userCmdLineOption field are supported for the simu=
lator.
        Alternatively, run the simulator standalone using the runSimulation=
 file in the netlist
        directory to know the exact cause of the error.


this is the runSimulation file content

spectre  input.scs +escchars +log ../psf/spectre.out +inter=3Dmpsc +mpssess=
ion=3Dspectre0_17653_1  -format psfxl -raw ../psf  +lqtimeout 900 -maxw 5 -=
maxn 5=20


this is the result of runSimulation if we run the above command in the cons=
ole



WARNING: HOST <idefix> DOES NOT APPEAR TO BE A CADENCE SUPPORTED LINUX CONF=
IGURATION.
         For More Info,  Please Run '<cdsroot>/tools.lnx86/bin/checkSysConf=
' <productId>.

/cad/cds03/Cadence_Tools/MMSIM/tools.lnx86/spectre/bin/32bit/spectre: /lib/=
tls/i686/cmov/libc.so.6: version `GLIBC_2.4' not found (required by /cad/cd=
s03/Cadence_Tools/MMSIM/tools.lnx86/spectre/bin/32bit/spectre)


this is the echo $PATH

/usr/bin/X11:/usr/local/bin:/usr/local/sbin:/usr/bin:/usr/sbin:/usr/lib:/sb=
in:/bin:/opt:/opt/etc:/cad/cds03/Cadence_Tools/MMSIM/tools/bin:/cad/cds03/C=
adence_Tools/INCISIV/bin:/cad/cds03/Cadence_Tools/INCISIV/tools/bin:/cad/cd=
s03/Cadence_Tools/INCISIV/tools/systemc/gcc/bin:/cad/cds03/Cadence_Tools/IC=
/tools/bin:/cad/cds03/Cadence_Tools/IC/tools/dfII/bin:/cad/cds03/Cadence_To=
ols/PVE/bin:/cad/cds03/Cadence_Tools/PVE/tools/bin:/cad/cds03/Cadence_Tools=
/ASSURA/tools/bin:/cad/cds03/Cadence_Tools/ASSURA/tools/assura/bin:/cad/cds=
03/Cadence_Tools/ASSURA/bin:/cad/mentor/tools/x86_cal_2012.3_15.13/bin:/cad=
/cds03/Cadence_Libraries/TSMC_TECH/TSMCMSRFLP_65_OA



----------------------------------------

I tried to google for possible solutions, but i couldn't find anything help=
ful..!! Any help regarding the issue is duly welcome.

1
vishwas
5/10/2013 9:14:33 PM
comp.cad.cadence 5429 articles. 8 followers. Post Follow

3 Replies
4272 Views

Similar Articles

[PageSpeed] 0

On 05/10/13 22:14, vishwas c n wrote:
> WARNING: HOST <idefix> DOES NOT APPEAR TO BE A CADENCE SUPPORTED LINUX CONFIGURATION.
>           For More Info,  Please Run '<cdsroot>/tools.lnx86/bin/checkSysConf' <productId>.
>

This bit would be the clue. I suspect you're running MMSIM11.1 or 
MMSIM12.1 (you didn't say), and these require you to be using RHEL5 or 
RHEL6 (or similar vintage SuSE), and running a 64 bit OS (note that 
spectre can be run in 32 bit or 64 bit mode, but the OS must be a 64 bit 
version).

Probably you're running an older OS revision on <idefix>. You should 
check that.

Regards,

Andrew.

0
Andrew
5/13/2013 2:16:19 PM
Hi, I come across the same problem with you. May I know how do you fix it?

Best,

Zr



On Friday, May 10, 2013 5:14:33 PM UTC-4, vishwas c n wrote:
> Hi, i was trying to run a simple test on a delay cell for the first time =
in virtuoso. I am getting the following error during Netlist and Run:
>=20
> =20
>=20
>=20
>=20
> ERROR (ADE-3036): Errors encountered during simulation. The simulator run=
 log has not been generated.
>=20
>         Possible cause could be an invalid command line option for the ve=
rsion of the simulator
>=20
>         you are running. Choose Setup->Environment and verify that the co=
mmand line options
>=20
>         specified in the userCmdLineOption field are supported for the si=
mulator.
>=20
>         Alternatively, run the simulator standalone using the runSimulati=
on file in the netlist
>=20
>         directory to know the exact cause of the error.
>=20
>=20
>=20
>=20
>=20
> this is the runSimulation file content
>=20
>=20
>=20
> spectre  input.scs +escchars +log ../psf/spectre.out +inter=3Dmpsc +mpsse=
ssion=3Dspectre0_17653_1  -format psfxl -raw ../psf  +lqtimeout 900 -maxw 5=
 -maxn 5=20
>=20
>=20
>=20
>=20
>=20
> this is the result of runSimulation if we run the above command in the co=
nsole
>=20
>=20
>=20
>=20
>=20
>=20
>=20
> WARNING: HOST <idefix> DOES NOT APPEAR TO BE A CADENCE SUPPORTED LINUX CO=
NFIGURATION.
>=20
>          For More Info,  Please Run '<cdsroot>/tools.lnx86/bin/checkSysCo=
nf' <productId>.
>=20
>=20
>=20
> /cad/cds03/Cadence_Tools/MMSIM/tools.lnx86/spectre/bin/32bit/spectre: /li=
b/tls/i686/cmov/libc.so.6: version `GLIBC_2.4' not found (required by /cad/=
cds03/Cadence_Tools/MMSIM/tools.lnx86/spectre/bin/32bit/spectre)
>=20
>=20
>=20
>=20
>=20
> this is the echo $PATH
>=20
>=20
>=20
> /usr/bin/X11:/usr/local/bin:/usr/local/sbin:/usr/bin:/usr/sbin:/usr/lib:/=
sbin:/bin:/opt:/opt/etc:/cad/cds03/Cadence_Tools/MMSIM/tools/bin:/cad/cds03=
/Cadence_Tools/INCISIV/bin:/cad/cds03/Cadence_Tools/INCISIV/tools/bin:/cad/=
cds03/Cadence_Tools/INCISIV/tools/systemc/gcc/bin:/cad/cds03/Cadence_Tools/=
IC/tools/bin:/cad/cds03/Cadence_Tools/IC/tools/dfII/bin:/cad/cds03/Cadence_=
Tools/PVE/bin:/cad/cds03/Cadence_Tools/PVE/tools/bin:/cad/cds03/Cadence_Too=
ls/ASSURA/tools/bin:/cad/cds03/Cadence_Tools/ASSURA/tools/assura/bin:/cad/c=
ds03/Cadence_Tools/ASSURA/bin:/cad/mentor/tools/x86_cal_2012.3_15.13/bin:/c=
ad/cds03/Cadence_Libraries/TSMC_TECH/TSMCMSRFLP_65_OA
>=20
>=20
>=20
>=20
>=20
>=20
>=20
> ----------------------------------------
>=20
>=20
>=20
> I tried to google for possible solutions, but i couldn't find anything he=
lpful..!! Any help regarding the issue is duly welcome.

0
sangzrustc
12/17/2013 2:54:40 AM
Hello,

Can you please explain a bit more clearly ?=20

KS
>=20
>=20
>=20
>=20
>=20
> On Friday, May 10, 2013 5:14:33 PM UTC-4, vishwas c n wrote:
>=20
> > Hi, i was trying to run a simple test on a delay cell for the first tim=
e in virtuoso. I am getting the following error during Netlist and Run:
>=20
> >=20
>=20
> > =20
>=20
> >=20
>=20
> >=20
>=20
> >=20
>=20
> > ERROR (ADE-3036): Errors encountered during simulation. The simulator r=
un log has not been generated.
>=20
> >=20
>=20
> >         Possible cause could be an invalid command line option for the =
version of the simulator
>=20
> >=20
>=20
> >         you are running. Choose Setup->Environment and verify that the =
command line options
>=20
> >=20
>=20
> >         specified in the userCmdLineOption field are supported for the =
simulator.
>=20
> >=20
>=20
> >         Alternatively, run the simulator standalone using the runSimula=
tion file in the netlist
>=20
> >=20
>=20
> >         directory to know the exact cause of the error.
>=20
> >=20
>=20
> >=20
>=20
> >=20
>=20
> >=20
>=20
> >=20
>=20
> > this is the runSimulation file content
>=20
> >=20
>=20
> >=20
>=20
> >=20
>=20
> > spectre  input.scs +escchars +log ../psf/spectre.out +inter=3Dmpsc +mps=
session=3Dspectre0_17653_1  -format psfxl -raw ../psf  +lqtimeout 900 -maxw=
 5 -maxn 5=20
>=20
> >=20
>=20
> >=20
>=20
> >=20
>=20
> >=20
>=20
> >=20
>=20
> > this is the result of runSimulation if we run the above command in the =
console
>=20
> >=20
>=20
> >=20
>=20
> >=20
>=20
> >=20
>=20
> >=20
>=20
> >=20
>=20
> >=20
>=20
> > WARNING: HOST <idefix> DOES NOT APPEAR TO BE A CADENCE SUPPORTED LINUX =
CONFIGURATION.
>=20
> >=20
>=20
> >          For More Info,  Please Run '<cdsroot>/tools.lnx86/bin/checkSys=
Conf' <productId>.
>=20
> >=20
>=20
> >=20
>=20
> >=20
>=20
> > /cad/cds03/Cadence_Tools/MMSIM/tools.lnx86/spectre/bin/32bit/spectre: /=
lib/tls/i686/cmov/libc.so.6: version `GLIBC_2.4' not found (required by /ca=
d/cds03/Cadence_Tools/MMSIM/tools.lnx86/spectre/bin/32bit/spectre)
>=20
> >=20
>=20
> >=20
>=20
> >=20
>=20
> >=20
>=20
> >=20
>=20
> > this is the echo $PATH
>=20
> >=20
>=20
> >=20
>=20
> >=20
>=20
> > /usr/bin/X11:/usr/local/bin:/usr/local/sbin:/usr/bin:/usr/sbin:/usr/lib=
:/sbin:/bin:/opt:/opt/etc:/cad/cds03/Cadence_Tools/MMSIM/tools/bin:/cad/cds=
03/Cadence_Tools/INCISIV/bin:/cad/cds03/Cadence_Tools/INCISIV/tools/bin:/ca=
d/cds03/Cadence_Tools/INCISIV/tools/systemc/gcc/bin:/cad/cds03/Cadence_Tool=
s/IC/tools/bin:/cad/cds03/Cadence_Tools/IC/tools/dfII/bin:/cad/cds03/Cadenc=
e_Tools/PVE/bin:/cad/cds03/Cadence_Tools/PVE/tools/bin:/cad/cds03/Cadence_T=
ools/ASSURA/tools/bin:/cad/cds03/Cadence_Tools/ASSURA/tools/assura/bin:/cad=
/cds03/Cadence_Tools/ASSURA/bin:/cad/mentor/tools/x86_cal_2012.3_15.13/bin:=
/cad/cds03/Cadence_Libraries/TSMC_TECH/TSMCMSRFLP_65_OA
>=20
> >=20
>=20
> >=20
>=20
> >=20
>=20
> >=20
>=20
> >=20
>=20
> >=20
>=20
> >=20
>=20
> > ----------------------------------------
>=20
> >=20
>=20
> >=20
>=20
> >=20
>=20
> > I tried to google for possible solutions, but i couldn't find anything =
helpful..!! Any help regarding the issue is duly welcome.

0
kanika
1/12/2014 6:46:22 PM
Reply:

Similar Artilces:

When is an error not an error?
When it's OSS slopware, of course. http://www.angelfire.com/planet/dfs0/Knode_send_error.png On 2006-09-12 02:42, * DFS wrote: > When it's OSS slopware, of course. > > http://www.angelfire.com/planet/dfs0/Knode_send_error.png > Well, some time ago I had a problem with OE - too long reference line to other posts, and OE of course refused to send... then crashed. Should I name it a feature? -- Andrea On Tue, 12 Sep 2006 03:25:29 +0200, Andrea wrote: > On 2006-09-12 02:42, * DFS wrote: >> When it's OSS slopware, of course. >> >> http:/...

When is an error not an error?
The Java language specification claims in: 8.8.7.1 Explicit Constructor Invocations .... "If an anonymous class instance creation expression appears within an explicit constructor invocation statement, then the anonymous class may not refer to any of the enclosing instances of the class whose constructor is being invoked." Helpfully it gives an example: "For example: class Top { int x; class Dummy { Dummy(Object o) {} } class Inside extends Dummy { Inside() { super(new Object() { int r = x; }); // err...

error or not an error ...
I was just testing out the R4 REXX thingy, and it found an error in the following program. My question is this, is it an error or not? My PC/REXX and Regina don't barf on it, but I thought they should've. _____________________________________________ /**/ ?.='' ?.z='batman' trace i if ?.z\==''then do; say '?.z=' ?.z; end ______________________________________________ Note that there is space before the THEN. I'm not sure of the exact rules for parsing an IF statement, I know that THEN is a "reserved" keyword when an IF statement is...

Objc Nubie: Errors Errors Errors
I've been toying with learning ObjC/Cocoa for sometime and finally got over the hump of "brackets vs. braces" but am wondering why my little test throws so many warnings when run: // gcc FileTest.m -o FileTest -ObjC -framework Cocoa #include <Cocoa/Cocoa.h> #include <Foundation/Foundation.h> int main( void ) { NSString * str = [ [NSStringalloc] initWithString:@"~/samplefromcocoa.txt" ]; NSString * full = [ NSString stringWithString: [str stringByExpandingTildeInPath ] ]; if( [ [NSFileManager defaultManager] fileExistsAtP...

error in cadence simulation
Dear all, I was trying to run a simple simulation in cadence Spectre. I got the following error. Any idea what it could mean?. /*********************** *Error* Errors encountered during simulation. The simulator run log has not been generated. Possible cause could be an invalid command line option for the version of the simulator specified in the userCmdLineOption field are supported for the simulator. Alternatively, run the simulator standalone using the runSimulation file in the netlist directory to know the exact cause of the error. /*********************** Since I'm new to schematic, I...

Cadence Spectre Error
Hi all, I am in the middle of a tapeout and suddenly spectre simulator is not running anymore. When I try to open the Analysis window in the Analog Design Environment, it gives me the following error: ************************************************* sevEditSelectedAnas('sevsession1) * Field is "pac_special" * *Error* hiCreateCyclicField: Value must be a string or icon list ERROR ************************************************* The Analysis window simply doesnot show up. From what I could gather fiddling around with ADE, this is specifically a Spectre problem because when I c...

Cadence LVS error
Hi, I am getting an error while running the LVS in Cadence. The error message says: The inv schematic has changed after it was last extracted. si: the netlist did not complete successfully. I had completed a sucessful LVS check on this schematic some time ago. No suddenly I see this error. I have not modified any schematics/ layout/ extracted layout. This error is not limited to onr schematic but all the schematics present in my library. I am not sure how to resolve this issue. Can someone please hyelp me find solution for this problem? Any help is really appreciated. Thank you, Pallavi ...

Error while running cadence!
Dear all, I had very little idea about the setup and configuration of cadence in Linux. I was successfully running cadence using "./ace51" command. But, today I got an error which says: ---------------------------------------------------------------------------------------------------------------------------------- ---------------------------------------------------------------------------------------------------------------------------------- ../ace51: line 694: /setup/GetENV: No such file or directory Hercules path : /bin/ **ACE51 Install Error** No ace50 generic r...

error C2106: error C2057 :error C3304:
I have faced intrinsic errors "error C2106 / error C2057 / error C3304" in Visual studio 2008. Though the source files have included with header files like "math.h" and "ctype.h", compilation gives error as given below. 2>c:\apps\microsoft visual studio 9.0\vc\include\string.h(48) : error C2106: '=' : left operand must be l-value 2>c:\apps\microsoft visual studio 9.0\vc\include\string.h(48) : error C2057: expected constant expression 2>c:\apps\microsoft visual studio 9.0\vc\include\string.h(48) : error C3304: 'PreAttribute': at...

Error directing BCP In errors to error file
Greetings, I am trying to bcp in data to a table which is in different server . Though the bcp in works fine but the error file is not being created and rejected records are not being directyd to the error file. Query looks like: bcp <db>..test_b_plan_cp in /home/file_out.txt -c -t '|' -S *****-U ****** -P ******-I /home/bcp2db_sql.ini -e /home/bcp2db.error. Can someone please help? TIA. Regards, Rajpreet ...

(assert-error) tests errors and error messages
I wrote (assert-error) to make sure that a function generates an error, and verify the error message. What do you think? Below is the definition and a few test cases, for Emacs 22.1.50. (require 'cl) (defmacro assert-error (form &optional regexp) "FORM must signal an error. Signal an error otherwise. Additionally, the error message must match REGEXP. Case is ignored while matching REGEXP." (let ((msg (make-symbol "msg")) (ok (make-symbol "ok")) (res (make-symbol "res"))) `(let ((,ok nil)) (condition-case err ...

Error Directing BCP In Errors to error file
Greetings, I am trying to bcp in data to a table which is in different server. Though the bcp in works fine but the error file is not being created and rejected records are not being directyd to the error file. Query looks like: bcp <db>..test_b_plan_cp in /home/file_out.txt -c -t '|' -S *****-U ****** -P ******-I /home/bcp2db_sql.ini -e /home/bcp2db.error. Can someone please help? TIA. Regards, Rajpreet ...

Error 8 Compilation Error. File permission error or DMA hardware error detected
I just upgraded my Labview code to Labview 8.5 from LV8.2.1 Then I tried to compile&nbsp;my code to get an .exe file I keep getting the following error, &nbsp; Visit the Request Support page at ni.com/ask to learn more about resolving this problem. Use the following information as a reference: Error 8 occurred at Write to Text File in AB_Engine_Update_INI_Header.vi-&gt;AB_Application.lvclass:Create_INI_File.vi-&gt;AB_Application.lvclass:Copy_Files.vi-&gt;AB_Build.lvclass:Build.vi-&gt;AB_EXE.lvclass:Build.vi-&gt;AB_Build.lvclass:Build_from_Wizard.vi-&gt;AB_UI_FR...

Robust error handling, an error while handling another error
I've been having this discussion a lot with my colleagues at work. A buffered file writer is the classic example. #include <fstream> int main() { std::ofstream fout("foo.txt"); if ( ! fout) return 1; //write important data to file //let the destructor implicitly close the file handle } The ofstream destructor will call flush then free the file handle, return it to the operating system. However, flush can fail. The disk can be full, for example. When flush fails, it sets a state flag, but there is no opportunity for the user to examine this state fl...

error: error sending
Hi, I hope somebody can help me. For sending mail I configured alpine with the following line: smtp.web.de/tls/user=xxxxxxx@web.de . But every time I tried the message "error sending" occured. To figure out more details I added the parameter debug, but there was no file .pine-debug. After reading the manual I tried: alpine -d 5 and got the message: Argument Error: unknown flag "d", debugging not compiled in Before downloading the source and compile it by my self, I thought I should ask you guys for help. My pine version: alpine-2.00-5.fc11.i586 Best regards Chris...

Error code when there is no error??
In my source I have: wndclass.hIcon = LoadIcon (hInstance, "test") ; test.ico is a valid icon. file. Everythig works ok. But when I test for an error like this: ShowLastError(); // no problems here wndclass.hIcon = LoadIcon (hInstance, "test") ; ShowLastError(); // I get "The system cannot find the file specidied" wndclass.hIcon get a valid handle. Here is my ShowLastError program: VOID ShowLastError(void) { LPVOID lpMsgBuf; DWORD error_code; int status; char sa1[1024]; error_code = Get...

error in, error out clusters.
Dear all, &nbsp; I am new user for Labview software. I try to create a Visa Configuration Serial Port but, the error occurred, message&nbsp;as: &nbsp; "You have two or more cluster data types wired together, but the clusters have different kinds or numbers of elements.Cluster Cluster 2, a cluster of 1 element, conflicts with cluster error in (no error), a cluster of 3 elements." &nbsp; My cluster include the function of: 1) boolean Properties 2) Numeric Properties 3) String Properties &nbsp; Q:&nbsp;how to create these 3 function in&nbsp;cluster? ...

error with ERROR function
Hi all, I'm getting an error when I use the "error" function. Here is the error message: ---------------------------------------- ??? Index exceeds matrix dimensions. Error in ==> C:\MATLAB6p5p1\mese\user_functions\ssave.m On line 765 ==> error('ERROR e43: Initial Operating Point file cannot be found'); ---------------------------------------- What matrix is it refering to? thanks, SK "Saif K" <buckeyeforever2001@yahoo.com> wrote in message news:eee53de.-1@webx.raydaftYaTP... > Hi all, > > I'm getting an error when I use the &quo...

Error upon Error...
anyone seen this error before: > Can't load '/usr/local/lib/perl5/5.8.0/PA-RISC2.0/auto/DB_File/DB_File.sl' for module DB_File: No such file or directory at /usr/local/lib/perl5/5.8.0/PA-RISC2.0/XSLoader.pm line 83. > at /usr/local/lib/perl5/5.8.0/PA-RISC2.0/DB_File.pm line 236 I'm just trying to run this script: #!/usr/bin/perl -w use strict; use DB_File; print "Hello World!\n" all three of the files exist on the system....why is it saying this. (there are a few scripts that I have that want to use DB_File and they all say this.... that's why I j...

timemachine error 11 (Error: (-36), Error: (-50))
I have a problem with Time machine exiting with error 11 rcently. > 6/8/09 3:26:32 PM /System/Library/CoreServices/backupd[795] Starting standard backup > 6/8/09 3:26:32 PM /System/Library/CoreServices/backupd[795] Backing up to: /Volumes/Time Machine Backups/Backups.backupdb > 6/8/09 3:27:37 PM /System/Library/CoreServices/backupd[795] No pre-backup thinning needed: 52.59 GB requested (including padding), 87.39 GB available > 6/8/09 3:28:57 PM /System/Library/CoreServices/backupd[795] Copied 1543 files (65.7 MB) from volume VadeMACum BootHD. > 6/8/09 3:48:09 PM /System/Library/CoreServices/backupd[795] Error: (-36) SrcErr:YES Copying /Volumes/HD3/Virtual Machines/Windows XP Professional.vmwarevm/Windows XP Professional.vmdk to (null) > 6/8/09 3:48:09 PM /System/Library/CoreServices/backupd[795] Error: (-50) SrcErr:NO Copying /Volumes/HD3/Virtual Machines/Windows XP Professional.vmwarevm/Windows XP Professional.vmdk to /Volumes/Time Machine Backups/Backups.backupdb/vademacum/2009-07-30-163253.inProgress/4AE47B8C-446F-494C-A823-F38BDA3C3F11/HD3/Virtual Machines/Windows XP Professional.vmwarevm > 6/8/09 3:48:09 PM /System/Library/CoreServices/backupd[795] Stopping backup. > 6/8/09 3:48:09 PM /System/Library/CoreServices/backupd[795] Error: (-8062) SrcErr:NO Copying /Volumes/HD3/Virtual Machines/Windows XP Professional.vmwarevm/Windows XP Professional.vmdk to /Volumes/Time Machine Backups/Backups.backupdb/vademacum/2009-07-30-163253.inProgress/4A...

SQL Errors: Where is the error?
I have just finished -- I hope I have finished -- some changes to one program of mine that has some hairy SQL. One of the SQL statments is 40 lines long. Granted it could be shorter vertically, but it is still 852 characters long. Occasionally -- read "All too often" -- while wrestling with this program, there would be an error in my SQL syntax. VFP is not terribly helpful with such error messages as Syntax error. Command is missing required clause. These are not terribly useful. Sometimes, I have hunted for minutes before realising that...

error C2197 error
Hello I am getting this error: error C2197: 'long (__stdcall *)(void)' : too many actual parameters Error executing cl.exe. The offending line is: if ((lResult = (*pfnGetProviderList)(0x00020000, pProviderList)) != 0) // this one { goto ProviderInstall_freeProviderList; } I am converting this C code into C++. Is the problem that compiler does not understand the parameters required for pfnGetProviderList? How can I fix? Angus wrote: > Hello > > I am getting this error: > > error C2197: 'long (__stdcall *)(void)' : too m...

Cadence Virtuoso ADE GXL
Hello everyone, I'm working on a project for school and am running some W/L optimizations in virtuoso's ade gxl package (version ic 6.1.3.500.13 under Red Hat Linux). That said, I was wondering how I could distribute the load across multiple computers. I do have access to each of the computers, and I know I could distribute matlab across the computers... I've just never done it before. If anything, perhaps a pointer towards a good tutorial would be great. Thanks for the help! Daniel Daniel wrote, on 12/01/09 05:35: > Hello everyone, > > I'm working on a project for school and am running some W/L > optimizations in virtuoso's ade gxl package (version ic 6.1.3.500.13 > under Red Hat Linux). > > That said, I was wondering how I could distribute the load across > multiple computers. I do have access to each of the computers, and I > know I could distribute matlab across the computers... I've just never > done it before. If anything, perhaps a pointer towards a good tutorial > would be great. > > Thanks for the help! > > Daniel This is controlled by the Job Policy setup (Options->Job Setup). Run "cdnshelp" from IC613 and then navigate to Analog Design Environment, then Virtuoso Analog Design Environment XL User Guide, then Chapter 12 "Simulating". This has links to the relevant manuals on setting up LBS (which can work with Platform Comput...

@@Error not catching error.
Hi all, I want to catch error in stored procedure and return error message. I want to catch error 'Syntax error converting the varchar value 'a' to a column of data type int.' Means error occuring if i enter wrong value. Say suppose i have statment like select * from emp where rowid = 'a' PRINT @@ERROR print 'reach' here rowid is integer value so i am getting above mention error. So what i am expecting is it should print error and then print 'reach' which is not happening. can anyone tell me reason behind this and how to overcome this problem. than...

Web resources about - Error (ADE-3036) - comp.cad.cadence

Resources last updated: 2/19/2016 9:08:05 PM