f



Error: Field 'F1' doesn't exist in destination table. I've created import Specs but still get same error...

I'm automating the import of all text files into Access from a source
folder. I was getting the "Field 'F1' doesn't exist in destination
table" error, so I checked it out on the net and it said to create a
import specification. So I did this (InductionImport), and included it
in my code as below:

DoCmd.TransferText acImportDelim, InductionImport,
"ImportedInductionLots", CurrentPath & strfile, 0

I created the import specs as per Microsoft's explanation:
http://support.microsoft.com/default.aspx?scid=kb;EN-US;142186

I'm at a loss as to how to fix it... except just calling the field
names F1 - F12 and renaming them later (which is a lot of mucking
around and a bit untidy). From what I understand, this Spec should
rename the fields as they are imported to match the names in the table.
And when I did it manually, it worked...

All ideas appreciated...

Cheers

Reg

0
p.heywood (76)
8/3/2005 9:18:08 PM
comp.databases.ms-access 42670 articles. 0 followers. Post Follow

2 Replies
1279 Views

Similar Articles

[PageSpeed] 39

DoCmd.TransferText acImportDelim, "MAIN Import Specification", "MAIN",
strFileToImport, True

Based on one I have that works, this is what I think is wrong - the
order of your arguments is wrong.

the second argument should be in quotes (the name of the import
specification).  That should fix it.  No, the import spec does not
rename any fields, it just maps values in the CSV file to the table.

0
pietlinden (2926)
8/3/2005 10:34:36 PM
Thankyou... works a charm.... excellent....

0
p.heywood (76)
8/4/2005 12:34:51 AM
Reply:

Similar Artilces:

Parse error: parse error, expecting `','' or `';''
I'm getting the following error Parse error: parse error, expecting `','' or `';'' in /home/notarywe/public_html/php/update2.php on line 108 Here is line 108 <input type="text" name="ud_first" value="<? echo "$first" size="20"?>"></td> Any help would be appreciated. On 3-Aug-2003, "entoone" <entoone@pacbell.net> wrote: > I'm getting the following error Parse error: parse error, expecting `','' > or > `';'' in /home/notarywe/public_h...

error: expected '=', ',', ';', 'asm' or '__attrib
Hi I'm trying to compile an ADC Driver & come acrosss the following error. I've no experience writing drivers before, and hence have no clue how to fix it. Hope someone out there has encountered the problem & suggesst a fix for the same. The Error is I get is : qadc.c: At top level: qadc.c:97: error: expected '=', ',', ';', 'asm' or '__attribute__' before 'qadc_read' make: *** [qadc.o] Error 1 [root@localhost qadc]# ########################################################################### ADC Driver Code ########################################################################### #define MODULE #define __KERNEL__ #include <linux/config.h> #include <linux/module.h> #include <linux/kernel.h> /* printk */ #include <linux/fs.h> / #include <linux/errno.h> /* error codes */ #include <linux/types.h> /* size_t */ #include <linux/proc_fs.h> /* proc file system */ #include <linux/fcntl.h> #include <asm/system.h> /* cli, flags */ #include <asm/uaccess.h> /* copy from/to user */ /*Registers to get qadc access*/ volatile unsigned short * qadcmcr = (unsigned short *)0x40190000; volatile unsigned short * qacr0 = (unsigned short *)0x4019000a; volatile unsigned short * qacr1 = (unsigned short *)0x4019000c; volatile unsigned short * qacr2 = (unsigned short *)0x4019000e; volatile unsigned short * qasr0 = (unsigned short *)0x40190010; volatile unsigned short * qasr1...

error: expected '=', ',', ';', 'asm' or '__attrib
Hi I'm trying to compile an ADC Driver & come acrosss the following error. I've no experience writing drivers before, and hence have no clue how to fix it. Hope someone out there has encountered the problem & suggesst a fix for the same. The Error is I get is : qadc.c: At top level: qadc.c:97: error: expected '=', ',', ';', 'asm' or '__attribute__' before 'qadc_read' make: *** [qadc.o] Error 1 [root@localhost qadc]# ########################################################################### ADC Driver Code ##...

'is not' or '!='
A newbie question to you; what is the difference between statements like: if x is not None: and if x != None: Without any context, which one should be preferred? IMHO, the latter is more readable. On 2014-08-18 21:35, ElChino wrote: > A newbie question to you; what is the difference between statements > like: > if x is not None: > and > if x != None: > > Without any context, which one should be preferred? > IMHO, the latter is more readable. > "x == y" tells you whether x and y refer to objects that are equal. "x is y" tells you whether x and y actually refer to the same object. In the case of singletons like None (there's only one None object), it's better to use "is". "ElChino" <elchino@cnn.cn>: > A newbie question to you; what is the difference between statements > like: > if x is not None: > and > if x != None: Do the following: take two $10 bills. Hold one bill in the left hand, hold the other bill in the right hand. Now, the bill in the left hand "is not" the bill in the right hand. However, the bill in the left hand "==" the bill in the right hand. > Without any context, which one should be preferred? > IMHO, the latter is more readable. In almost all cases, both tests would result in the same behavior. However, the "is not" test is conceptually the correct one since you want...

'^=' and '~='?
Hello, What is the difference between '^=' and '~='? Thanks, Duckhye ...

How is there an 'error' with 'no message'
I have a form with many fields, each of which has their separate record sources in a split db. Today, several users throughout the afternoon encountered the following message when accessing various dropdowns on the form: "Error (-1517). There is no message for this error." Three questions: 1. Has anyone encountered this error before? 2. If so, how was it overcome? 3. How can MS produce an error message that states : "There is no message for this error"? It would seem to me that if MS has assigned a number to an error, they must know that it can happen. If they know it can happen, then they must know under what circumstances it happens. If they know this, then there is at least some "message" for this error. Puzzled... Earl Anderson On Apr 15, 8:44=A0pm, "Earl Anderson" <isob...@optonline.net> wrote: > I have a form with many fields, each of which has their separate record > sources in a split db. =A0Today, several users throughout the afternoon > encountered the following message when accessing various dropdowns on the > form: =A0"Error (-1517). =A0There is no message for this error." Three > questions: > 1. =A0Has anyone encountered this error before? > 2. If so, how was it overcome? > 3. How can MS produce an error message that states : "There is no message > for this error"? > > It would seem to me that if MS has assigned a number to an error, they mus= t...

When I do from lxml import etree I've this error : AttributeError: 'module' object has no attribute 'BytesIO'
Hi, I'm on Ubuntu 8.04.1 I've installed lxml with easy_install lxml command. Now, when I load etree I've this error : $ python Python 2.5.2 (r252:60911, Apr 21 2008, 11:12:42) [GCC 4.2.3 (Ubuntu 4.2.3-2ubuntu7)] on linux2 Type "help", "copyright", "credits" or "license" for more information. >>> from lxml import etree Traceback (most recent call last): File "<stdin>", line 1, in <module> File "lxml.etree.pyx", line 40, in lxml.etree (src/lxml/ lxml.etree.c:119415) AttributeError: 'module&#...

error C2143: syntax error : missing ';' before '*'
Hi all, how to remove the following complle error. When I compiling the code I get the following errors: Compiling... CDrtEachDefFeat.cpp d:\ include\common\cdrtintegfeat.h(39) : error C2143: syntax error : missing ';' before '*' d:\ include\common\cdrtintegfeat.h(39) : error C2501: 'CDrtEachDefFeat' : missing storage-class or type specifiers d:\ include\common\cdrtintegfeat.h(39) : error C2501: 'm_pdrtEachDefFeat' : missing storage-class or type specifiers In code the files are included in the order, CDrtEachDefFeat has # include "CDrtTeachData"...

How to change 'On Error Goto ArreurA' with 'On Error Goto ArreurB' without error if an error occured?
Exemple: On Error Goto ErreurA Picture = LoadPicture(VarName1) On Error Goto ErreurB Picture = LoadPicture(VarName2) exit sub ErreurA: msgbox "ErreurA= VarName1" exit sub ErreurB: msgbox "ErreurB= VarName2" Exit sub If an error occudes with Picture = LoadPicture(VarName2) it cause an error and the program stop there without error message. What code line must I add? Raymond H. "Raymond H." <divers_rh@hotmail.com> wrote in message news:TuHRc.6180$a65.235836@news20.bellglobal.com... > Exemple: > > On Error Goto ErreurA > Picture = LoadPicture(VarName1) > On Error Goto ErreurB > Picture = LoadPicture(VarName2) > exit sub > ErreurA: > msgbox "ErreurA= VarName1" > exit sub > ErreurB: > msgbox "ErreurB= VarName2" > Exit sub > > If an error occudes with > Picture = LoadPicture(VarName2) > it cause an error and the program stop there without error message. What > code line must I add? In the IDE, go to Tools->Options->General Tab. Select 'Break on Unhandled Errors'. Hello, this error occure even with the exe. I think it miss a code line in my projet but I don't know wich one. r.h. "Peter Young" <youngpa@comcast.no.net.spam.please> a �crit dans le message de news:eBMRc.229775$%_6.160126@attbi_s01... > > "Raymond H." <divers_rh...

Any reason why $_FILES['userfile']['error'] wouldn't be populated?
Hi, I am in the middle of writing an image upload script and am limiting the size of uploads via upload_max_filesize. This all seems to be working well, and if I try and upload a bigger file then I get an UPLOAD_ERR_INI_SIZE sat in $_FILES['userfile']['error']. All hunkey dorey. However, in my testing there are one or two large files that cause problems. PHP appears to abort the upload early as it should, but when my script runs, $_FILES isn't populated at all?! I have tried to narrow down the difference in these file but I can't seem to find anything definate. All t...

Procedure error: 'chceckVote' in 'field list'
CREATE PROCEDURE addVoteAll (profil_Id int ( 11 ) , commmen_Id int ( 11 ) , grande_ smallint ( 1 )) NOT DETERMINISTIC CONTAINS SQL SQL SECURITY DEFINER COMMENT '' BEGIN DECLARE checkVote smallint(2) DEFAULT 0; SET @checkVote = (select count(*) from vote where profilId=3 and commentId=3); IF chceckVote=0 then INSERT INTO vote (voteId,profilId,commentId,grande) VALUES (null,profil_Id,commmen_Id, grande_); END IF; commit; END; Unknown column 'chceckVote' in 'field list' whats wrong? On 23 Apr 2007 01...

getting fileinput to do errors='ignore' or 'replace'?
I'm having trouble with some input files that are almost all proper UTF-8 but with a couple of troublesome characters mixed in, which I'd like to ignore instead of throwing ValueError. I've found the openhook for the encoding for line in fileinput.input(options.files, openhook=fileinput.hook_encoded("utf-8")): do_stuff(line) which the documentation describes as "a hook which opens each file with codecs.open(), using the given encoding to read the file", but I'd like codecs.open() to also have the errors='ignore' or errors='repla...

I don't get why '>' doesn't get printed in the following example
When I do a here-document, the '>' character shows up to indicate the start of a newline. [cdalten@localhost ~]$ cat << EOF > My current directory is dir $PWD > EOF My current directory is dir /home/cdalten [cdalten@localhost ~]$ What prevents the '>' characters from showing up in the final output? On Jul 3, 10:35 am, Chad <cdal...@gmail.com> wrote: > When I do a here-document, the '>' character shows up to indicate the > start of a newline. > > [cdalten@localhost ~]$ cat << EOF> My current directory is dir $PWD > &...

'''''''''''''The Running Update/Append Queries Using VBA code Ordeal'''''''''''''' #2
Hi, Thanks for ur help there HJ. I know how to do the tasks you specified there. I would like for the update query to use field values from some of the fields on the form (frmInvoices) such as InvoiceNumber, DateFrom, DateTo. My problem is that an append/update query can't find the values in the open Form (frmInvoices) when I specify them as; [Forms]![frmInvoices]![InvoiceNumber] a select query has no problem finding the field values on a form. please help. Aaron Hi Aaron, Could you post the entire code that you are having trouble with? Now it is not possible to see what goes wrong. HJ "Aaron" <aaron@rapid-motion.co.uk> wrote in message news:260d7f40.0408120245.2f3d01f8@posting.google.com... > Hi, > > Thanks for ur help there HJ. > > I know how to do the tasks you specified there. > > I would like for the update query to use field values from some of the > fields on the form (frmInvoices) such as InvoiceNumber, DateFrom, > DateTo. My problem is that an append/update query can't find the > values in the open Form (frmInvoices) when I specify them as; > > [Forms]![frmInvoices]![InvoiceNumber] > > a select query has no problem finding the field values on a form. > > please help. > > Aaron First off, if you are not always using all the parameters specified in your form, then you have to add parameters to your query on the fly. Also, you can't just do something like qdf.SQL = "SE...

if str_mo not in ('','.') and str_da not in ('','.') and str_yy not in ('','.') Any shorter ?
Hi, there. =20 I'm just curious if it ever dawned on anybody how to abbreviate this line : if str_mo not in ('','.') and str_da not in ('','.') and str_yy not in ('','.')=20 =20 Igor Kurbeko Clinical Programmer Analyst 678 336 4328 ikurbeko@atherogenics.com =20 no brain no pain =20 how about: if not (str_mo in ('','.') or str_da in ('','.') or str_yy in ('','.')) OR if not (missing(str_mo) or missing(str_da) or missing(str_yy)) Eric On 22 Oct 03 21:13:37 GMT, ikurbeko@ATHER...

error opening class 'CuDv'/'CuAt'/'CuDvDr'
Hi all, I am facing the exact problem as already raised in this group in the following link on AIX 5.1 (64-bit): http://www.google.co.in/groups?hl=en&lr=&ie=UTF-8&oe=UTF-8&th=7acc930280417746&rnum=2 Can anyone help? I am new to AIX drivers so a detailed explaination is appreciated. Thanks in advance. --Pawan ...

Removing the letters 't' 'i' 'x' and 'y'
Im having trouble with figuring out how to write a function which will remove the letters 't' 'i' 'x' and 'y' from any input string in matlab. for example modstr(pixy) should result in ans = 'p' or modstr(picture) should result in ans = 'pcure' if anyone could offer any help or hints i would really appreciate it. Thank You >> modstr=@(s) s(~ismember(s,'tixy')) modstr = @(s)s(~ismember(s,'tixy')) >> modstr('picture') ans = pcure % Bruno ...

error message; microsoft access can't find the field 'ToggleLink' referred to in your expression
i have a couple of buttons in a database which when pressed give the above error message. when I click OK i get access to the form anyway. how can i get rid of this apparent glitch? many thanks grahamwarren2009@googlemail.com wrote: > i have a couple of buttons in a database which when pressed give the > above error message. when I click OK i get access to the form anyway. > how can i get rid of this apparent glitch? many thanks Do you have access to the code. If so, open up a code module for the form and do a CTRL+F and search your code for references to ToggleLink. Perhaps it was a field that existed but was renamed or removed but something is still referring to it. On 14 Mar, 20:45, Salad <o...@vinegar.com> wrote: > grahamwarren2...@googlemail.com wrote: > > i have a couple of buttons in a database which when pressed give the > > above error message. when I click OK i get access to the form anyway. > > how can i get rid of this apparent glitch? many thanks > > Do you have access to the code. =A0If so, open up a code module for the > form and do a CTRL+F and search your code for references to ToggleLink. > =A0 =A0 =A0Perhaps it was a field that existed but was renamed or removed= but > something is still referring to it. Tried that sorry, can't see what ToggleLink refers to. Is there any way I can get someone to look at file and play with it to try and fix? (It's about 42MB but don't know why it...

perlcc error
Hi, I'm a perl hack and want to distribute a windows executable of one of my scripts. When I invoke the perl compiler by using perlcc, I get the following error. perlcc.bat: Can't unlink error file pccrYVGS If I try multiple times, the error is the same but the filename changes. I googled and didn't see anything that would help me. One thing I did find out was that a recent installation of some development tools blew away portions of my 'path' environment variable, including the path to the perl bin directory (which also has perlcc.bat). I have restored this to th...

Parse error: syntax error, unexpected T_CONSTANT_ENCAPSED_STRING, expecting ',' or ';'
I'm sure this is a common erro amongst newbies like me but what i'm trying to echo is text with html tags. Look below. I'm sure there is something wrong with my syntax. You help much apprecaited. I get the error line after the first </table>';. // print intro echo '<div id="memcol"> <table width="100%" border="0" cellpadding="0"> <tr> <th><h3>Welcome!</h3></th> </tr> <tr> <td><p> Thank you helping me out. We hope you find our service educational. Provided ...

A function with 'and' , 'not' , 'null' , 'car' and 'cdr'
What's this ? (defun enigma (x) (and (not (null x)) (or (null (car x)) (enigma (cdr x))))) "I suppose I should learn Lisp, but it seems so foreign." - Paul Graham, Nov 1983 On Wed, Oct 07 2015, CAI GENGYANG wrote: > What's this ? > > > (defun enigma (x) > (and (not (null x)) > (or (null (car x)) > (enigma (cdr x))))) Bad taste? It returns T if the list X contains nil as an element. It would be clearer to write (some #'null x). Helmut CAI GENGYANG ...

to get my ''PLP''
I tried to install the MATLAB in my computer but idon't have my personal license password.i would like how to get my PLP? buy it Hi, http://www.mathworks.com/support/solutions/data/1-16LU2.html J�r�me ...

wxStringBuffer gets error C2248: 'wxString::wxString' : cannot access private member declared in class 'wxString'
Hello supposed to work? this is VC6.0: wxStringBuffer sb(buf,2); if (file_data.Read(sb != 2)) { This gets compiler error xString::wxString' : cannot access private member declared in class 'wxString' pointing to the Read line. Using 2.4.2 in VC6.0 winXP based on wxStringBuffer example code. Thanks Todd. Hi, If this is still a problem, perhaps it would help to clarify the items below. In article <1111102623.335993.175500@g14g2000cwa.googlegroups.com>, todma <toddmarshall2002@yahoo.com> writes >Hello >supposed to work? this...

ipfw 'table' doens't exist? Gives "ipfw: setsockopt(IP_FW_TABLE_ADD): Invalid argument" Error
Hey, I've recently setup ipfw to attempt to block some of the abusers trying to gain access to my web server and have run into a problem. I was originally using add rules like so: add 600 deny log all from 218.0.0.0/8 to any in add 601 deny log all from 202.0.0.0/7 to any in add 602 deny log all from 219.0.0.0/8 to any in But after reading some information from newsgroups I was told it's best to use a table to deny large amounts of people as it improves efficiency, and was told to setup my ipfw.rules like so: ipfw table 666 add 218.0.0.0/8 ipfw table 666 add 202.0.0.0/7 ipfw table 666 add 219.0.0.0/8 ipfw table 666 add 222.0.0.0/8 ipfw table 666 add 124.0.0.0/8 ipfw add 400 deny ip from table(666) to any However when trying to run this, I get a seres of errors that all repeat the same thing: "ipfw: setsockopt(IP_FW_TABLE_ADD): Invalid argument" Not sure how to resolve this and my extensive Google searches have turned up nothing besides C scripting for ipfw. Any help would be greatly appreciated. Thanks in Advance. Inferno wrote: > ipfw table 666 add 218.0.0.0/8 > ipfw table 666 add 202.0.0.0/7 > ipfw table 666 add 219.0.0.0/8 > ipfw table 666 add 222.0.0.0/8 > ipfw table 666 add 124.0.0.0/8 > ipfw add 400 deny ip from table(666) to any > > However when trying to run this, I get a seres of errors that all > repeat the same thing: > > "ipfw: setsockopt(IP_FW_TABLE_ADD...

Web resources about - Error: Field 'F1' doesn't exist in destination table. I've created import Specs but still get same error... - comp.databases.ms-access

Resources last updated: 3/21/2016 8:19:03 AM