f



Error execute() takes at most 3 arguments (5 given)

hi,
   I am inserting data into database, but it's showing error-
  Error execute() takes at most 3 arguments (5 given)
my code is--

import simplejson as json
import MySQLdb

def jsontoMySQL():
    data = json.load(open('data0.0.0.json','r'))
    try:
        conn=MySQLdb.connect(host="127.0.0.1",
                        user="root",
                        passwd="avnesh",
                        db="datapro",port=3306)
        x= conn.cursor()
        for i in range(0,len(data)-1):
            top_id = data[i]['top_id']
            us_id = data[i]['us_id']
            iss_id = data[i]['iss_id']
            ca_id = data[i]['ca_id']
            name = data[i]['name']
            sql1 = "insert into sqlapp_checking(top_id, name) values(%s, '%s')" %(top_id, name)
            sql2 = "insert into sqlapp_checking_unis(unis) values(%s)" %(un_id)
            sql3 = "insert into sqlapp_checking_inst(inst) values(%s)" %(iss_id)
            sql4 = "insert into sqlapp_checking_cat(cat) values(%s)" %(ca_id)
            x.execute(sql1,sql2,sql3, sql4)
            conn.commit()
        conn.close()
    except Exception, e:
        print "Error %s" % e

jsontoMySQL()

I have made many to many field relationship using django project, It's showing error, please help me, how is it possible insert whole data together, I m new for mysql.

Thanks.
0
Avnesh
5/28/2013 4:16:32 AM
comp.databases.mysql 6944 articles. 1 followers. laredotornado (869) is leader. Post Follow

2 Replies
2960 Views

Similar Articles

[PageSpeed] 10

On 28/05/13 06:16, Avnesh Shakya wrote:
> hi,
>     I am inserting data into database, but it's showing error-
>    Error execute() takes at most 3 arguments (5 given)
>              x.execute(sql1,sql2,sql3, sql4)

It gives you this fault as you are giving it more arguments that it can 
handle, you should take a look at the mysqldb documentation.

try
x.execute(sql1)


-- 

  //Aho
0
J
5/28/2013 4:40:06 AM
Avnesh Shakya wrote:

>    I am inserting data into database, but it's showing error-
>   Error execute() takes at most 3 arguments (5 given)

And there is a stack trace and a line number attached.

> my code is--
> 
> import simplejson as json
> import MySQLdb
> 
> [more Python]
>         conn=MySQLdb.connect(host="127.0.0.1",
>                         user="root",
>                         passwd="avnesh",
>                         db="datapro",port=3306)
> [more Python]
>            conn.execute(sql1,sql2,sql3, sql4)

I very much doubt that the API of some MySQL module for Python is on-topic 
here.  RTFM.

> I have made many to many field relationship using django project, It's
> showing error, please help me, how is it possible insert whole data
> together, I m new for mysql.

    There was no pause.  He just kept talking in one long incredibly
    unbroken sentence moving from topic to topic so that no-one had 
    a chance to interrupt; it was really quite hypnotic.
                               –“Capt. Picard” in ST:TNG “Timescape”

Only that you are not Dr. Vassbinder, so there is no excuse for your 
posting.

<http://www.catb.org/~esr/faqs/smart-questions.html>

-- 
PointedEars

Twitter: @PointedEars2
Please do not Cc: me. / Bitte keine Kopien per E-Mail.
0
Thomas
5/28/2013 12:19:17 PM
Reply:

Similar Artilces:

Error while ACE 5.3.1 or 5.4.1 compiling and installing by MinGW 3.3.3
Hi, I have installed MinGW packages: binutils-2.13.90-20030111-1.tar.gz gcc-core-3.3.3-20040217-1.tar.gz gcc-g++-3.3.3-20040217-1.tar.gz mingw-runtime-3.3.tar.gz w32api-2.5.tar.gz Also I've configured environment due to ACE-INSTALL.html according MinGW compiler. OS: WinXP SP2. $ACE_ROOT=F:\ACE531 I get next compiling error: F:\ACE531\ace>gmake gmake.EXE[1]: Entering directory `F:/ACE531/ace' d:\Utils\Unix\diff.EXE: -: Invalid argument gmake.EXE[1]: Leaving directory `F:/ACE531/ace' gmake.EXE[1]: Entering directory `F:/ACE531/ace' d:/Utils/Unix/gmake.EXE -f Makefile.dirs SUBDIR_TARGET=all RMCast.subdir gmake.EXE[2]: Entering directory `F:/ACE531/ace' d:/Utils/Unix/gmake.EXE -f Makefile -C RMCast all gmake.EXE[3]: Entering directory `F:/ACE531/ace/RMCast' Installing libACE_RMCast.dll -> F:\ACE531/ace d:\Utils\Unix\cp.EXE: F:ACE531aceRMCast/libACE_RMCast.dll: No such file or directory Installing libACE_RMCast.dll -> F:\ACE531/ace d:\Utils\Unix\cp.EXE: F:ACE531aceRMCast/libACE_RMCast.dll: No such file or directory gmake.EXE[3]: *** [F:\ACE531/ace/libACE_RMCast.dll] Error 1 gmake.EXE[3]: Leaving directory `F:/ACE531/ace/RMCast' gmake.EXE[2]: *** [RMCast.subdir] Error 2 gmake.EXE[2]: Leaving directory `F:/ACE531/ace' gmake.EXE[1]: *** [all.nested] Error 2 gmake.EXE[1]: Leaving directory `F:/ACE531/ace' d:\Utils\Unix\gmake.EXE: *** [all] Error 2 There are no folder separators in path (for exampl...

Compilation error with g++ 3.3.2 on AIX 5.3
Hi, i have a simple makefile which looks like this: CArchive: CFileRw.o CArchive.o CMain.o g++ -o CArchive CFileRw.o CArchive.o CMain.o 3rdparty_1.a CFileRw.o: CFileRw.cxx HCommon.h g++ -c CFileRw.cxx CArchive.o: CArchive.cxx HCommon.h g++ -c CArchive.cxx CMain.o: CMain.cxx HCommon.h g++ -c CMain.cxx clean: rm CArchive CFileRw.o CArchive.o CMain.o When i try complining this on AIX 5.3 with g++ 3.3.2. It gives the below mentioned error g++ -o CArchive CFileRw.o CArchive.o CMain.o 3rdparty_1.a ld: 0711-447 SEVERE ERROR: Shared object 3rdpa...

RE: Compiling 2.5.5 on Mac OS X with CW 8.3
Hi Jos=E9 > unfortunately jpeg is required by wxWindows (circular reference) > and wx/wx_cwc.h is referred nowhere in the jpeg lib, removing the > prefix is the way to go the way this is usually done is by precompiling the headers, this is = mandatory for all projects that really need the correct defines. You are = correct with the changes done in jconfig.h for jpeg lib this is not = necessary anymore. > (what happened with my patch to solve this (end lot of others) issue > with CodeWarrior) I'm applying it right now piece by piece, I have to do the project...

TypeError: startView() takes exactly 1 argument (3 given)
Hello, I am trying to write a plugin for Rhythmbox in python and run into a 'strange' problem. For a method (an action for clicking a button) I started a method and however many arguments I use, it keeps giving me the same error: 'TypeError: startView() takes exactly 1 argument (3 given)' does someone have any pointers or tips?, thanks; Ron here is the code I have the problem with: import rb import pygtk import gtk, gobject pygtk.require('2.0') class tb_button (rb.Plugin): # # the init thing # def __init__(self): r...

[tao-users] ACE 5.3.5 + TAO 1.3.5 + CIAO 0.3.5 beta released
Hi We are happy to announce a new beta of ACE-5.3.5, TAO-1.3.5 and CIAO-0.3.5. This beta comes with new ORB level services that were developed over the past few months by folks at Washington University and University of Rhode Island. Please see the release notes attached with this email for more information. As usual the latest release is available at: http://deuce.doc.wustl.edu/Download.html The doxygen documentation for the beta will be updated in the next few hours! We highly encourage you to download the present beta and use it with your applications and let us know if there are any p...

Error making krb5-1.5.1 on AIX 5.3 TL 5
When running make on krb5-1.5.1 I get the following errors: Target "all" is up to date. gcc -L../../../lib -Wl,-blibpath:/usr/krb5/lib::/usr/lib:/lib -g -O2 -Wa ll -Wmissing-prototypes -Wcast-qual -Wcast-align -Wconversion -Wshadow -pedanti c -L/usr/linux/lib,Wl,-brtl,-blibsuff:so -o client client.o rpc_test_clnt.o -lg ssrpc -lgssapi_krb5 -lkrb5 -lk5crypto -lcom_err -lkrb5support ld: 0711-317 ERROR: Undefined symbol: krb5_gss_dbg_client_expcreds ld: 0711-317 ERROR: Undefined symbol: gssrpc_auth_debug_gssapi ld: 0711-317 ERROR: Undefined symbol: gssrpc_misc_debug_gssapi ld:...

Re: [ace-users] Errors while compiling c++ 3.4.2
Hi Eyal, I believe we've fixed these problems in the latest version of ACE that's tucked inside our CVS repository. Can you please take a look at this version available in http://deuce.doc.wustl.edu/Download.html and see if things work better. If not, please let us know so we can fix them before we release ACE 5.4.3 in a week or so. Thanks, Doug >> I get the following while compiling: >> >> /usr/bin/c++ -D_POSIX_C_SOURCE=199506L -DNDEBUG -DUSING_GCC >> -D_POSIX_PTHREAD_SEMANTICS -DLINUX -I../inc >> -I../3rd_party/ACE-5.3.0/ACE_wrappers -fPIC -pedantic -fno-for-scope >> -Wno-long-long -Wno-deprecated -o Trace.o.linux -c Trace.cpp >> In file included from >> ../3rd_party/ACE-5.3.0/ACE_wrappers/ace/Unbounded_Set.h:306, >> from ../3rd_party/ACE-5.3.0/ACE_wrappers/ace/Memory_Pool.h:30, >> from ../3rd_party/ACE-5.3.0/ACE_wrappers/ace/Malloc.h:414, >> from ../3rd_party/ACE-5.3.0/ACE_wrappers/ace/String_Base.cpp:3, >> from ../3rd_party/ACE-5.3.0/ACE_wrappers/ace/String_Base.h:423, >> from ../3rd_party/ACE-5.3.0/ACE_wrappers/ace/SString.h:17, >> from >> ../3rd_party/ACE-5.3.0/ACE_wrappers/ace/Configuration.h:34, >> from >> ../3rd_party/ACE-5.3.0/ACE_wrappers/ace/Configuration_Import_Export.h:28, >...

Re: [tao-users] ACE 5.3.5 + TAO 1.3.5 + CIAO 0.3.5 beta released
Hi Folks, It's been about a year since we released ACE 5.3 and TAO 1.3. We are therefore planning to release ACE 5.4 and TAO 1.4 by mid-December. The ACE+TAO x.3.5 beta that Venkita just announced will be the penultimate beta towards that goal. In addition to all the enhancements that he mentioned in the release notes, we also plan to add the following enhancements before the x.4 release: ---------------------------------------- .. ACE subsetting enhancements .. ORB footprint and compilation-time enhancements .. CORBA Security Service capabilities .. Load Balancing Servi...

Build Error in MinGW 3.4.5 of ACE 5.7
Hi! Have problem to build ACE under Windows XP in MinGW (We can build it in Linux, Slackware 11, and other dists ) When we build we get following Error == $ make make[1]: Entering directory `/d/downloads/ACE/ACE_wrappers_5.7.2/ace' GNUmakefile: /d/downloads/ACE/ACE_wrappers_5.7.2/ace/GNUmakefile.ACE MAKEFLAGS=w g++ -Wpointer-arith -mthreads -mtune=pentiumpro -O3 -g -pipe - pipe -I/d/downloads/ACE/ACE_wrappers_5.7.2 -DACE_HAS_EXCEPTIONS - DACE_NO_INLINE -I.. -DACE_BUILD_DLL -c -o .shobj/Local_Name_Space.o Local_Name_Space.cpp In file included from d:/downloads/ACE/ACE_wrappers_5.7.2/ace/ TSS_T.cpp:19, from d:/downloads/ACE/ACE_wrappers_5.7.2/ace/TSS_T.h: 245, from d:/downloads/ACE/ACE_wrappers_5.7.2/ace/ Singleton.h:24, from d:/downloads/ACE/ACE_wrappers_5.7.2/ace/ Service_Gestalt.h:30, from d:/downloads/ACE/ACE_wrappers_5.7.2/ace/ Service_Object.h:27, from d:/downloads/ACE/ACE_wrappers_5.7.2/ace/ Naming_Context.h:25, from d:/downloads/ACE/ACE_wrappers_5.7.2/ace/ Local_Name_Space_T.h:25, from d:/downloads/ACE/ACE_wrappers_5.7.2/ace/ Local_Name_Space.h:128, from Local_Name_Space.cpp:1: d:/downloads/ACE/ACE_wrappers_5.7.2/ace/OS_NS_stdio.h: In function `void* ace_fileno_helper(FILE*)': d:/downloads/ACE/ACE_wrappers_5.7.2/ace/OS_NS_stdio.h:123: error: expected primary-expression before ...

Error with mysql 5.5.8 and postfix
Hello, I updated mysql to 5.5.8 with ports and now I have this error on maillog: postfix/cleanup[70267]: warning: connect to mysql server 127.0.0.1: Can't initialize character set latin1 (path: usr/local/share/mysql/charsets) /usr/local/share/mysql/charsets/latin1.xml: http://pastebin.com/kuaDe2VX /usr/local/share/mysql/charsets/Index.xml http://pastebin.com/GGdz96kQ any idea? thanks! -- http://www.promomopoli.com ...

Re: [tao-users] ACE 5.3.5 + TAO 1.3.5 + CIAO 0.3.5 beta released #2
Hi Tom, > We are currently arm-wrestling with TAO-1.3.3 on VxWorks-5.5/Tornado-2.2 > built with non-native exceptions and with implicit templates. Implicit > templates are desirable since we are now using STL and those nested > templates make explicit instantiation almost impossible. Non-native > exceptions are important since native exceptions lead to a factor of 4.5 > increase in code size (!!). > > Implicit templates cause trouble with singletons, since the VxWorks-2.x > loader does not respect weakly-defined symbols, so one can not load > multiple mo...

error: macro "check" passed 3 arguments, but takes just 1 #2
Hello! I have a problem with porting to XCode. In CW code compiles well. But in XCode I've got the following: error: macro "check" passed 3 arguments, but takes just 1 In code "check" is a macro, and virtual member of class. Build fail on class member declaration "chak" with this message. Thanks!!! ...

Re: [tao-users] ACE 5.3.5 + TAO 1.3.5 + CIAO 0.3.5 beta released #2 #2
Hi Alex, > What are OCI's plan's for a supported TAO 1.4 release and developer > guide? Will this effect the release of the 1.3 guide? This is an excellent question - I'm sure Malcolm Spence will pitch in when he has a chance and I suspect that OCI will be supporting TAO 1.4 in due time. None of the changes in TAO 1.4 should affect the relevance of the info in the TAO 1.3 developer's guide - there's just more new stuff to document as time permits. Take care, Doug ...

mysql in c++ initialize error occurs a simple program is executed in redhat9.0 , using gcc 3.2.2 compiler version ...
mysql in c++ initialize error occurs a simple program is executed in redhat9.0 , using gcc 3.2.2 compiler version ... #include <stdio.h> #include <mysql.h> #include <string.h> int main() { MYSQL* mysql; MYSQL_RES* res; MYSQL_ROW row; char query[80]; mysql = mysql_init( NULL ); if( mysql == NULL ) { mysql_real_connect( mysql, "localhost", "username", "password","dbname", 0, "/tmp/mysql.sock", 0 ); ...

mysql in c++ initialize error occurs a simple program is executed in redhat9.0 , using gcc 3.2.2 compiler version ...
mysql in c++ initialize error occurs a simple program is executed in redhat9.0 , using gcc 3.2.2 compiler version ... #include <stdio.h> #include <mysql.h> #include <string.h> int main() { MYSQL* mysql; MYSQL_RES* res; MYSQL_ROW row; char query[80]; mysql = mysql_init( NULL ); if( mysql == NULL ) { mysql_real_connect( mysql, "localhost", "username", "password","dbname", 0, "/tmp/mysql.sock", 0 ); sprintf( query...

mysql in c++ initialize error occurs a simple program is executed in redhat9.0 , using gcc 3.2.2 compiler version ...
mysql in c++ initialize error occurs a simple program is executed in redhat9.0 , using gcc 3.2.2 compiler version ... #include <stdio.h> #include <mysql.h> #include <string.h> int main() { MYSQL* mysql; MYSQL_RES* res; MYSQL_ROW row; char query[80]; mysql = mysql_init( NULL ); if( mysql == NULL ) { mysql_real_connect( mysql, "localhost", "username", "password","dbname", 0, "/tmp/mysql.sock", 0 ); sprintf( query, "SELECT * FROM tablename" ); mysql_real_query( mysql, query, (unsigned int)strlen(query) ); res = mysql_use_result( mysql ); while( row = mysql_fetch_row( res ) ) { printf( "%s %s\n", row[0], row[1] ); } mysql_free_result( res ); mysql_close( mysql ); } else { printf( "mysql_init returned NULL\n" ); } return 0; } "n1.cpp" 34L, 656C written if i run the code iam getting the error as follows [root@localhost yog]# gcc n1.cpp /tmp/cccUdCdL.o(.text+0x16): In function `main': : undefined reference to `mysql_init' /tmp/cccUdCdL.o(.text+0x4b): In function `main': : undefined reference to `mysql_real_connect' /tm...

Database Metadata
I know in mysql 5 you can get metadata from a database using the Information_Schema technique. How can this done in mysql version 4? Thanks, Kelly Greer KellyGreer1@nospam.com replace nospam with yahoo > I know in mysql 5 you can get metadata from a database using the > Information_Schema technique. > How can this done in mysql version 4? Have a look at the SHOW commands in the documentation. -- Martijn Tonies Database Workbench - development tool for MySQL, and more! Upscene Productions http://www.upscene.com My thoughts: http://blog.upscene.com/martijn/ Database development q...

Re: Configuring multi-port NIC on DS10 with DECNET-Plus and TCPIP 5.3 5.3 5.3
Hello, Each NIC does have its own MAC. The two configured one will be shown also with its IP address. It is possible to use one of the two NIC of DS10 for TCP/IP and the other one for DECnet. AFAIK DECnet will change the MAC to an so called physical address, which contains the area and subarea number. Best regards R. Wingert "Rudolf Wingert" <win@fom.fgan.de> wrote in message news:<000d01c53f29$110338c0$994614ac@wat153>... > Hello, > > Each NIC does have its own MAC. The two configured one will be shown > also with its IP address. It is possible to use on...

dcmtk ijg_boolean, changes from 3.5.2 to 3.5.3
Hello, Just thought i'll share some quirks i stumbled on while using the jpeg libraries (and wrappers that come with DCMTK) and compiling them with another project. The problem was that ijg defines boolean differently from other system hearders (on windows). Luckily ijg allows to change the definition of "boolean" in the headers (in my case: from int to unsigned char). Although the change makes my project happy, other parts of dcmtk 3.5.3 are not, while this went smoothly in 3.5.2. Browsing through the dcmtk files I think following declarations might have to be changed (unix diff format): djdijg8.cxx: 97c97 < int DJDIJG8fillInputBuffer(j_decompress_ptr); --- > ijg_boolean DJDIJG8fillInputBuffer(j_decompress_ptr); 125c125 < int DJDIJG8fillInputBuffer(j_decompress_ptr cinfo) --- > ijg_boolean DJDIJG8fillInputBuffer(j_decompress_ptr cinfo) djeijg8.cxx: 85c85 < int DJEIJG8emptyOutputBuffer(j_compress_ptr cinfo); --- > ijg_boolean DJEIJG8emptyOutputBuffer(j_compress_ptr cinfo); 115c115 < int DJEIJG8emptyOutputBuffer(j_compress_ptr cinfo) --- > ijg_boolean DJEIJG8emptyOutputBuffer(j_compress_ptr cinfo) Regards, Igor ...

PalmOS 3.5.0 to 3.5.3 upgrade for IIIxe
Hello, I recently picked up a IIIxe for a young nephew to play with, and have tried to apply the upgrade mentioned in the subject. After HotSyncing, I get an Out of Memory message, Unable to install after the IIIxe resets. If I check the version message it says 3.5.3 as the OS version. I noticed that on another site, it said to download Victor 3.5 to free orphan memory before applying the update. I did this, but am still getting the out of memory message. On every reset, the message pops up again. I never get the message Palm says I should regarding it being all right to delete th...

ERROR: REINDEX DATABASE: Can be executed only on the currently open database.
I suspect there is something wrong because it takes 73s to delete a single line from a table whith 140 lines. So I tried to reindex the database: bash-2.05b$ postgres -P -O -D /var/lib/pgsql/data KakaoStats LOG: database system was shut down at 2004-04-11 19:55:10 BRT LOG: checkpoint record is at 7/9505D650 LOG: redo record is at 7/9505D650; undo record is at 0/0; shutdown TRUE LOG: next transaction id: 24438; next oid: 1850892 LOG: database system is ready POSTGRES backend interactive interface 1.307.2.1 2003/01/01 21:57:18 backend> reindex database KakaoStats ERROR: ...

Error while updating from KDE 3.1.5 to KDE 3.2
-----BEGIN PGP SIGNED MESSAGE----- Hash: SHA1 Hi all, i'm running a Gentoo Linux 1.4 with Kernel 2.6.3 and KDE 3.1.5. So far everything works fine. But as is tried to update to KDE 3.2, I everytime got the error message below. Does anyone have an idea whats wrong and what I can do against? /bin/sh ../../libtool --silent --mode=link --tag=CXX g++ -Wnon-virtual-dtor - -Wno-long-long -Wundef -Wall -W -Wpointer-arith -Wwrite-strings -ansi - -D_XOPEN_SOURCE=500 -D_BSD_SOURCE -Wcast-align -Wconversion - -Wchar-subscripts -DNDEBUG -DNO_DEBUG -O2 -O3 -march=i686 -funroll-loops - -pipe -Wformat...

VMS 7.3 VAX, TCPIP 5.3: error in FINGER
Has anyone else seen this? VMS 7.3 VAX, TCPIP 5.3, all ECOs applied. %SYSTEM-F-ROPRAND, reserved operand fault at PC=000028C1, PSL=03C00000 Improperly handled condition, image exit forced. Signal arguments Stack contents Number = 00000003 454C4156 Name = 00000454 20202020 000028C1 20202020 03C00000 00000004 00000000 00000020 00000008 00000040 00000020 00000020 Register dump R0 = 0015E43E R1 = 7FD0E3D8 R2 = 7FD0E4B9 R3 = 0015E410 R4 = 000B1300 R5 = 00000001 R6 = 00000CD0 R7 = 00000E32 R8 = 000B12D0 R9 = 000009A8 R...

if time = 3 seconds, how do i set the values of the time steps 0,0.1,0.2,0.3,0.5,1.0,1.5,2.0,3.0,5.0 to -9999 from time =3 seconds
Hi &nbsp; I have 18 inputs (arrays) which contain certain statistics and if time&nbsp;&nbsp;= 3 seconds, set the values of time step 5.0 to -9999.0. &nbsp; I was wondering if there is an efficient way to do this without using a lot of case statements? &nbsp; Thank you. Hello AdrianT, it's not really clear to me what you want to do... I suspect: you have an array containing values and you want to output them with a fixed timing of 3 seconds: you should use a for loop autoindexing trough your array and sending the value to your indicator/output/whatever. Put a "wait for next multiple" into your for loop. Or do you want to have a minimum time delay of 3 seconds? Again use a for loop, get the time value and use a InRange&amp;Coerce with minimum set to 3 seconds... Or you should explain more precisely what you need... Hi Thanks for that. Let me explain. &nbsp; The time may vary. Let me give an example. if time&nbsp; = 2.1, I want to set the time step's &nbsp;3.0 and 5.0's values to -9999.0. if the time =0.1 seconds then I want to set 0.2,0.3, 0.5 etc values to -9999.0 etc .................................................................... &nbsp; Can you please help? Thank you. Hello TUDS, do you use different accounts/nicknames ? Well, that's easy, at least for a sorted array: Search for your time-value in the array (Threshold 1D array). Fill all elements from that index till the end with your "error...

Web resources about - Error execute() takes at most 3 arguments (5 given) - comp.databases.mysql

Argument (linguistics) - Wikipedia, the free encyclopedia
In linguistics , an argument is an expression that helps complete the meaning of a predicate . Most predicates take one, two, or three arguments. ...

Bikie admits killing stranger after argument over dog named Trouble
A Bandidos bikie has admitted killing a drunken stranger who stumbled across the gang's Brunswick clubhouse and began harassing one of their ...

Bikie admits killing stranger after argument over dog named Trouble
A Bandidos bikie has admitted killing a drunken stranger who stumbled across the gang's Brunswick clubhouse and began harassing one of their ...

Freddie Gray case: What you need to know about the Court of Appeals arguments
Prosecutors and defense attorneys in the Freddie Gray case will sparred today&amp;nbsp;in the highest court in Maryland, arguing whether Officer ...

The government makes ‘dormant cyber pathogen’ argument in iPhone FBI wants
What are “dormant cyber pathogens” you ask? It’s a sort of computer network infection, according to the U.S. government, which could produce ...

A peek at the general election argument
A peek at the general election argument by digby There will be a lot of words but this is it in a nutshell: "We have a big problem at this point, ...

Samsung Echoes Apple's Arguments on Importance of User Privacy
Samsung Electronics Co. called customer privacy “extremely important” and said any requirement to build backdoors into its devices would undermine ...

11 juiciest arguments made in the Apple vs. FBI iPhone fight
A slew of tech companies throw their weight behind Apple. Here's the gist of what they're saying.

Supreme Court justices show their differences during oral arguments in crucial abortion case
In what was originally slated to be an hour of oral arguments, the U.S. Supreme Court went 19 minutes overtime Wednesday in the case of a Texas ...

There're Bad Arguments And Then There're Insane Ones About US Inequality
It's possible to make some reasonable and fair points about inequality in the United States. There's more of it than there is in most other rich ...

Resources last updated: 3/10/2016 5:39:01 AM