f



Error 8 Compilation Error. File permission error or DMA hardware error detected

I just upgraded my Labview code to Labview 8.5 from LV8.2.1
Then I tried to compile my code to get an .exe file 
I keep getting the following error,
 
Visit the Request Support page at ni.com/ask to learn more about resolving this problem. Use the following information as a reference:
Error 8 occurred at Write to Text File in AB_Engine_Update_INI_Header.vi->AB_Application.lvclass:Create_INI_File.vi->AB_Application.lvclass:Copy_Files.vi->AB_Build.lvclass:Build.vi->AB_EXE.lvclass:Build.vi->AB_Build.lvclass:Build_from_Wizard.vi->AB_UI_FRAMEWORK.vi->AB_Item_OnDoProperties.vi->AB_Item_OnDoProperties.vi.ProxyCaller
Possible reason(s):
LabVIEW:  File permission error. You do not have the correct permissions for the file.=========================NI-488:  DMA hardware error detected.
C:\UserData\LabView\IFX Interop Test exe\GMXiTest.ini
 
I never have this problem if I compile using LV8.2.1.
Please help! Thanks.
 
0
x9561 (148438)
9/13/2007 9:10:09 AM
comp.lang.labview 35213 articles. 1 followers. vasusachin24 (1) is leader. Post Follow

2 Replies
3053 Views

Similar Articles

[PageSpeed] 43

hi there
just to be sure: has 8.5 been installed under an other account than yours? make sure you have the windows access rigths to the LabVIEW - folder.
0
x9561 (148438)
9/13/2007 12:10:10 PM
Hi,
Yes I have administrator rights on the PC. It was installed with full R/W permission. 
I saw in the forum that others are having the same problem and tried this work-around mentioned but it did not work.
<a href="http://forums.ni.com/ni/board/message?board.id=170&amp;message.id=172537&amp;query.id=115461#M172537" target="_blank">http://forums.ni.com/ni/board/message?board.id=170&amp;message.id=172537&amp;query.id=115461#M172537</a> 
<a href="http://forums.ni.com/ni/board/message?board.id=170&amp;message.id=158187&amp;requireLogin=False" target="_blank"> </a>&nbsp; 
Any ideas?
Message Edited by nantha on 09-13-2007  06:57 AMMessage Edited by nantha on 09-13-2007  06:58 AM
0
x9561 (148438)
9/13/2007 12:10:11 PM
Reply:

Similar Artilces:

When is an error not an error?
The Java language specification claims in: 8.8.7.1 Explicit Constructor Invocations .... "If an anonymous class instance creation expression appears within an explicit constructor invocation statement, then the anonymous class may not refer to any of the enclosing instances of the class whose constructor is being invoked." Helpfully it gives an example: "For example: class Top { int x; class Dummy { Dummy(Object o) {} } class Inside extends Dummy { Inside() { super(new Object() { int r = x; }); // err...

When is an error not an error?
When it's OSS slopware, of course. http://www.angelfire.com/planet/dfs0/Knode_send_error.png On 2006-09-12 02:42, * DFS wrote: > When it's OSS slopware, of course. > > http://www.angelfire.com/planet/dfs0/Knode_send_error.png > Well, some time ago I had a problem with OE - too long reference line to other posts, and OE of course refused to send... then crashed. Should I name it a feature? -- Andrea On Tue, 12 Sep 2006 03:25:29 +0200, Andrea wrote: > On 2006-09-12 02:42, * DFS wrote: >> When it's OSS slopware, of course. >> >> http:/...

error or not an error ...
I was just testing out the R4 REXX thingy, and it found an error in the following program. My question is this, is it an error or not? My PC/REXX and Regina don't barf on it, but I thought they should've. _____________________________________________ /**/ ?.='' ?.z='batman' trace i if ?.z\==''then do; say '?.z=' ?.z; end ______________________________________________ Note that there is space before the THEN. I'm not sure of the exact rules for parsing an IF statement, I know that THEN is a "reserved" keyword when an IF statement is...

Error directing BCP In errors to error file
Greetings, I am trying to bcp in data to a table which is in different server . Though the bcp in works fine but the error file is not being created and rejected records are not being directyd to the error file. Query looks like: bcp <db>..test_b_plan_cp in /home/file_out.txt -c -t '|' -S *****-U ****** -P ******-I /home/bcp2db_sql.ini -e /home/bcp2db.error. Can someone please help? TIA. Regards, Rajpreet ...

Error Directing BCP In Errors to error file
Greetings, I am trying to bcp in data to a table which is in different server. Though the bcp in works fine but the error file is not being created and rejected records are not being directyd to the error file. Query looks like: bcp <db>..test_b_plan_cp in /home/file_out.txt -c -t '|' -S *****-U ****** -P ******-I /home/bcp2db_sql.ini -e /home/bcp2db.error. Can someone please help? TIA. Regards, Rajpreet ...

Objc Nubie: Errors Errors Errors
I've been toying with learning ObjC/Cocoa for sometime and finally got over the hump of "brackets vs. braces" but am wondering why my little test throws so many warnings when run: // gcc FileTest.m -o FileTest -ObjC -framework Cocoa #include <Cocoa/Cocoa.h> #include <Foundation/Foundation.h> int main( void ) { NSString * str = [ [NSStringalloc] initWithString:@"~/samplefromcocoa.txt" ]; NSString * full = [ NSString stringWithString: [str stringByExpandingTildeInPath ] ]; if( [ [NSFileManager defaultManager] fileExistsAtP...

error 8 File permission error while building executable for a RT
I got error 8 File permission error while building executable for a RT. It happened always after build, I mean new startup.rtexe and startup.alias files have been created. At the build properties, it was set use default .alias file. I had the executable built successfully at one time. &nbsp; The detail message is: Visit the Request Support page at ni.com/ask to learn more about resolving this problem. Use the following information as a reference: Error 8 occurred at Open/Create/Replace File in RTBEP_Generate_Deploy_Instructions.vi-&gt;RTBEP_Invoke_Build_Engine.vi-&gt;RTBUIP_Build...

Error 8 occurred when building an executable due to file permission error?
I received this error on executable builds from two different .vis.&nbsp; Other .vis in the project build without incident and the message below doesn't seem to indicate the file that is causing the problem, unless it is the SPT-errors.txt file listed at the end of the error message. &nbsp; Visit the Request Support page at ni.com/ask to learn more about resolving this problem. Use the following information as a reference: Error 8 occurred at Copy in AB_Engine_Copy_Error_Files.vi-&gt;AB_Application.lvclass:Copy_Error_Files.vi-&gt;AB_Application.lvclass:Copy_Files.vi-&gt...

(assert-error) tests errors and error messages
I wrote (assert-error) to make sure that a function generates an error, and verify the error message. What do you think? Below is the definition and a few test cases, for Emacs 22.1.50. (require 'cl) (defmacro assert-error (form &optional regexp) "FORM must signal an error. Signal an error otherwise. Additionally, the error message must match REGEXP. Case is ignored while matching REGEXP." (let ((msg (make-symbol "msg")) (ok (make-symbol "ok")) (res (make-symbol "res"))) `(let ((,ok nil)) (condition-case err ...

error C2106: error C2057 :error C3304:
I have faced intrinsic errors "error C2106 / error C2057 / error C3304" in Visual studio 2008. Though the source files have included with header files like "math.h" and "ctype.h", compilation gives error as given below. 2>c:\apps\microsoft visual studio 9.0\vc\include\string.h(48) : error C2106: '=' : left operand must be l-value 2>c:\apps\microsoft visual studio 9.0\vc\include\string.h(48) : error C2057: expected constant expression 2>c:\apps\microsoft visual studio 9.0\vc\include\string.h(48) : error C3304: 'PreAttribute': at...

configure: error --- compile error
can u help me and guide a litte bit? please. [root@home cyrus-imapd-2.1.15]# ./configure creating cache ./config.cache checking host system type... i686-pc-linux-gnu checking for makedepend... /home/auser/cyrus-imapd-2.1.15/tools/not-mkdep configure: warning: Makedepend is not installed on this system. You should compile and install the version from the makedepend subdirectory. checking for gcc... gcc checking whether the C compiler (gcc ) works... yes checking whether the C compiler (gcc ) is a cross-compiler... no checking whether we are using GNU C... yes checking whether gcc accepts...

FFT error (compiler error?)
Hi, My FFT function suddenly stopped working, even trying a simple input it returns the following error: EDU>> fft(zeros(1,128)) libmwfftw: load error: dlsym(0x125219ba0, fftw_plan_guru64_dft): symbol not found Caught "std::exception" Exception message is: dlsym(0x125219ba0, fftw_plan_guru64_dft): symbol not found I'm running MATLAB 7.12.0 (R2011a), on a Mac OS X Version 10.7.5. Any idea how to fix this? I tried recompiling FFTW 3.3.3, but I still get the error. Cheers, Mathieu "Mathieu " <matt.turtles@gmail.com> wrote in message ...

errors in errors file description
Hello All Firstly All the very Best for 07. Does anyone know of any documentation/ web site references that describes the errors generated in the errors file. Best Regards list-errors? ChrisM wrote: > Hello All > > Firstly All the very Best for 07. > > Does anyone know of any documentation/ web site references that describes > the errors generated in the errors file. > > Best Regards I think he wants to know more about the errors themselves than just seeing the text. Really the errors file is a catch-all where just about anything...

@@Error not catching error.
Hi all, I want to catch error in stored procedure and return error message. I want to catch error 'Syntax error converting the varchar value 'a' to a column of data type int.' Means error occuring if i enter wrong value. Say suppose i have statment like select * from emp where rowid = 'a' PRINT @@ERROR print 'reach' here rowid is integer value so i am getting above mention error. So what i am expecting is it should print error and then print 'reach' which is not happening. can anyone tell me reason behind this and how to overcome this problem. than...

Web resources about - Error 8 Compilation Error. File permission error or DMA hardware error detected - comp.lang.labview

Other compilation albums of Westlife - Wikipedia, the free encyclopedia
The album consists of a range of well known hits, remixes, b-sides and international language versions. "Don't Calm The Storm" and "I Won't Let ...

Kate Moss Catwalk Compilation - YouTube
The one and only Kate Moss saunters down the catwalk. Footage circa 1994/1995. Designers include Gianni Versace, Anna Sui, Karl Lagerfeld and ...

Animals in Super Bowl Ads: Video Compilation - Special: Super Bowl - AdAge
Cheetahs and horses and bears, oh my! Spots featuring fuzzy, scaly and winged creatures are a time-honored tradition in the Super Bowl. Over ...

Instagram Spotlight Compilations to Shine More Frequently
Instagram launched curated content streams called Spotlight Compilations this past Halloween, and the Facebook-owned photo- and video-sharing ...

A compilation of people hurting themselves on their new Christmas Hoverboards
Hoverboards might not be safe or legal in all places, but they’re definitely popular gifts, especially around Christmas , but controlling these ...

Saetia releasing discography compilation on Touche Amore frontman's label, streaming live album; M/R ...
Short-lived screamo greats Saetia already released the career-spanning compilation A Retrospective in 2001, and this year they'll release another ...

Compilation Of Bunnies Yawning
Submitted by: (via The Dodo ) Tagged: bunnies , yawning , compilation , bunny , Video Share on Facebook

A Compilation Of Every Time R2-D2 Saved The Day
This is a compilation of every time R2-D2 saves the day in the first six Star Wars movies. He deserves a medal. Without him, pretty much everybody ...

Connor Franta Debuts Fourth Compilation Album 'Common Culture Vol 4'
Connor Franta is back with another compilation album and it's going to be even more awesome than last year's! The ...

An Animated Pixel Art Compilation of Shocking Death Scenes in Star Wars
Animator Filipe Costa of PipocaVFX and artist Matheus Muniz joined forces to create an animated pixel art compilation video of some of the most ...

Resources last updated: 2/9/2016 3:42:52 AM