f



cross compilation error

/../include/krb5 -I./../../include/krb5 -I. -I.
-I/opt/mipsel-linux/mipsel-unknown-linux-gnu/gcc-3.3.4-glibc-2.3.2/include/c++/3.3.4/
-I/opt/mipsel-linux/mipsel-unknown-linux-gnu/gcc-3.3.4-glibc-2.3.2//mipsel-unknown-linux-gnu/include/
-I/opt/mipsel-linux/mipsel-unknown-linux-gnu/gcc-3.3.4-glibc-2.3.2//mipsel-unknown-linux-gnu/sys-include
-I/home/vijay/httpd-2.0.52/srclib/apr-util/xml/expat/lib/ -g -O2 -Wall
-Wmissing-prototypes -Wcast-qual  -Wcast-align -Wconversion -Wshadow
-pedantic -pthread -c threads.c -o threads.so.o && mv -f threads.so.o
threads.so
In file included from threads.c:34:
.../../include/k5-platform.h:375:3: #error "Don't know how to do
unload-time finalization for this configuration."
threads.c:37: warning: type defaults to `int' in declaration of
`MAKE_FINI_FUNCTION'
threads.c:37: warning: parameter names (without types) in function
declaration
threads.c:37: error: ISO C forbids data definition with no type or
storage class
threads.c:398: warning: no previous prototype for
`krb5int_call_thread_support_init'
threads.c:444: warning: no previous prototype for
`krb5int_thread_support_fini'
make[2]: *** [threads.so] Error 1
make[2]: Leaving directory
`/home/vijay/Kerberos/MIPS/krb5-1.4.2/src/util/support'
make[1]: *** [all-recurse] Error 1
make[1]: Leaving directory
`/home/vijay/Kerberos/MIPS/krb5-1.4.2/src/util'
make: *** [all-recurse] Error 1


while cross compiling for mipsel-linux on RH and FC.

Any help ?
Vijay

0
purpletech (17)
9/14/2005 12:18:21 AM
comp.protocols.kerberos 5541 articles. 1 followers. jwinius (31) is leader. Post Follow

1 Replies
545 Views

Similar Articles

[PageSpeed] 29

Alright.

mipsel cross compilation from RH& FC went fine with some tweaking in:

include/k5-platform.h
appl/gssftp/ftp/domacro.c 
appl/gssftp/ftp/ftp_var.h

--
Vijay

0
purpletech (17)
9/14/2005 6:36:44 PM
Reply:

Similar Artilces:

Cross-compiling error when compiling 2.6.1...
I come across the following error: checking for chflags... configure: error: cannot run test program while cross compiling See `config.log' for more details. make-3.81[1]: *** [/nobackup/garrcoop/python_upgrade/contrib/python/obj-mips32/Makefile] Error 1 make-3.81[1]: Leaving directory `/nobackup/garrcoop/python_upgrade' make-3.81: *** [all] Error 2 The blurb from configure that does this test says: # On Tru64, chflags seems to be present, but calling it will # exit Python Basically this testcase (while valid for Tru64) doesn't work with many cross-compilation environments. Cou...

[tao-users] tao_ifr from IFR_Service in a ARM9 cross compilation error to compile
--00504501416d53702a047cdffaf1 Content-Type: text/plain; charset=ISO-8859-1 ACE VERSION: 5.5a - 5.6a and 5.7.5 TAO VERSION: 1.5a - 1.6a and 1.7.5 HOST MACHINE and OPERATING SYSTEM: PC Linux Debian Lenny 2.6.26-2-486 TARGET MACHINE and OPERATING SYSTEM: ARM-linux-v5EJl 2.4.20-celf3 HOST COMPILER NAME AND VERSION (AND PATCHLEVEL): GCC-3.3.2 glibc-2.3.2 TARGET COMPILER NAME AND VERSION (AND PATCHLEVEL): ARM-LINUX gcc-3.3.2-glibc-2.3.2 CONTENTS OF $ACE_ROOT/ace/config.h: config-linux.h CONTENTS OF $ACE_ROOT/include/makeinclude/platform_macros.GNU: platform_linux.GNU CONTENTS OF $ACE_ROOT/bin/MakeProjectCreator/config/default.features: $ACE_ROOT/bin/mwc.pl -type gnuace LEVEL OF URGENCY (LOW, MEDIUM, or HIGH): MEDIUM AREA/CLASS/EXAMPLE AFFECTED: tao_ifr implement DOES THE PROBLEM AFFECT: 1. The compilation SYNOPSIS: Hello, i have problem compiling the IFR_Service in a cross compilation, specifically compiling tao_ifr DESCRIPTION: Exporting the variables #################################################### export ACE_ROOT=/ACE_wrappers-OCI/STATIC/TARGET export TAO_ROOT=$ACE_ROOT/TAO export HOST_ROOT=/ACE_wrappers-OCI/STATIC/HOST export PATH=$PATH:$ACE_ROOT/bin export LD_LIBRARY_PATH=$LD_LIBRARY_PATH:$HOST_ROOT/lib ##################################################### export ARM_ROOT=/arm-linux/gcc-3.3.2-glibc-2.3.2 export CC=$ARM_ROOT/bin/arm-linux-gcc export CPP=$ARM_ROOT/...

Kerberos Cross Compiling
Hi I'm trying upgrade from krb5-1.3.2 to krb5-1.3.4 in a cross compile enviroment, but it does not work. I notice that are some changes in aclocal.m4, about cross compiling. I changed it so I can compile and use a MPC 8xx as a kerberos client, but the GSSAPI authentication don't work. In openssh I got a "Generic Unknow RC/IO error", with krlogind I got "Bad sendauth version was sent". Can you help me? -- ------------------------------------------------------------ �v� Sulamita Garcia Cyclades Brasil /(_)\ Projetista Software JR ^ ^ Phone: 55 11 5033 3393 ________________________________________________ Kerberos mailing list Kerberos@mit.edu https://mailman.mit.edu/mailman/listinfo/kerberos On Sep 13, 2004, at 15:31, Sulamita Garcia wrote: > I'm trying upgrade from krb5-1.3.2 to krb5-1.3.4 in a cross compile > enviroment, but it does not work. I notice that are some changes in > aclocal.m4, about cross compiling. I changed it so I can compile and > use a MPC 8xx as a kerberos client, but the GSSAPI authentication > don't work. In openssh I got a "Generic Unknow RC/IO error", with > krlogind I got "Bad sendauth version was sent". Can you help me? If your tools all work, there's a good chance the problem is in the results of the configure tests. There are probably a few tests that are run that assume that the host and target systems (borrowing the GNU terms for c...

Errors when cross-compiling the kernel
Trying to cross-compile the Raspberry Pi kernel on a Debian 7 virtual PC. I've got quite a way through the process, and it seems to start compiling, but I'm getting the following error: HOSTLD scripts/genksyms/genksyms CC scripts/mod/empty.o /home/david/kern/tools/arm-bcm2708/arm-bcm2708-linux-gnueabi/bin/../lib/gcc/arm-bcm2708-linux-gnueabi/4.7.1/../../../../arm-bcm2708-linux-gnueabi/bin/as: error while loading shared libraries: libz.so.1: cannot open shared object file: No such file or directory Any ideas? I can't find libz.so anywhere.... Thanks,...

RC3 kerberos compile error
I compiled samba release candidate 2 yesterday without any errors. Today I noticed rc3 was available and downloaded the source, configured it with the same parameter as rc2: ../configure --with-krb5=/usr/local/bin But this time the 'make' returned the following errors: Compiling libads/kerberos.c libads/kerberos.c: In function `kerberos_kinit_password': libads/kerberos.c:84: warning: passing arg 6 of `krb5_get_init_creds_password' d iscards qualifiers from pointer target type Compiling ...

Error while cross compiling libcurl library
Hi, I am using openwrt white russian SDK to cross compile my c code.The code uses curl library so I added libcurl.so in the lib folder of the SDK. I think this is a problem of version mismatch. Because I read in one of group posts that '' represents hidden dependencies in linux and here for example I an also getting undefined reference to `abort@GLIBC_2.0' Now when I cross compile the c code it gives error /home/inovationlab/test2/OpenWrt-SDK-Linux-i686-1/staging_dir_mipsel/bin/../lib/gcc/mipsel-linux-uclibc/3.4.4/../../../../mipsel-linux-uclibc/lib/libcurl.so: undef...

error while compiling kerberos on win CE
Hello, I am trying to compile latest MIT Kerberos source on win ce. But I am getting syntax errors for the system installed files like include/winnt.h, include/windows.h etc. Have any one compiled Kerberos on win CE. Regards, Prerana DISCLAIMER ========== This e-mail may contain privileged and confidential information which is the property of Persistent Systems Ltd. It is intended only for the use of the individual or entity to which it is addressed. If you are not the intended recipient, you are not authorized to read, retain, copy, print, distribute or use this message. If you have received this communication in error, please notify the sender and delete all copies of this message. Persistent Systems Ltd. does not accept any liability for virus infected mails. ...

mingw32 cross compile _stricmp error
Hello, I am trying to use mingw32 to cross-compile my program so it runs on windows. I am using debian linux, so I have the debian mingw32 package installed, and I've managed to get the "minimal" sample that comes with wxWindows compiling as a working windows executable, so something is at least partly right. But when I try to compile my real code, I get the following error: /usr/include/wx/string.h: In member function `int wxString::CmpNoCase(const * wxChar*) const': * /usr/include/wx/string.h:644: `_stricmp' undeclared (first use this function) ...

bind 9 cross compilation error
Hi all, I am a newbie to bind9. I have started cross compiling bind9 for my target arm-linux platform and I keep getting some errors while configuring bind9. ../configure --target=arm-linux --host=i686-pc-linux-gnu --prefix=/home/cm-x270/cmrootfs/ BUILD_CC=/scratchbox/compilers/arm-gcc-3.3.4-glibc-2.3.2/bin/arm-linux-gcc configure: WARNING: If you wanted to set the --build type, don't use --host. If a cross compiler is detected then cross compile mode will be used. ..... checking for random device... /dev/random checking for /dev/random... configure: error: cannot check for file existence when cross compiling sara:/home/sara/bind-9.4.1# I have my host development x86 machine running linux and /scratchbox tool for cross compilation (/scratchbox/compilers/arm-gcc-3.3.4-glibc-2.3.2/bin/arm-linux- ). Can anyone precise me how can I cross compile bind9 for my arm platform using scratchbox ? Thanks Sara ...

[tao-users] Cross compilation error
ACE VERSION: ACE version 6.0.0 TAO version 2.0.0 ACE version 5.7.0 TAO version 1.7.0 HOST MACHINE and OPERATING SYSTEM: Desk Top PC Dual Core Processor: Intel(R) Core(TM)2 Duo CPU E4400 @ 2.00GHz Memory: 1.9 GiB Ubuntu Linux 8.04 (hardy) TARGET MACHINE and OPERATING SYSTEM, if different from HOST: MicroBlaze soft core arch inside Virtex 6 FPGA from Xilinx Linux Version 2.6.37-rc4 COMPILER NAME AND VERSION (AND PATCHLEVEL): Cross Toolchain powerpc-microblaze-unknown-linux-gnu 4.1.2 Using built-in specs. Target: microblaz...

Error in building Complete Cross Compiler for ARM
Iam facing Error in building Complete cross compiler for ARM the error is ERROR: No support for this host and target combination. This is the only one error iam getting. Iam using GCC version -3.4.1 Bin Utilities-2.15 Run time C library -1.12. Please solve my problem. Thanks in advance ---Madhu.A.G. - You could have provided the current target name tou are currently using, this would have helped people to help you. - List of targets is available in gcc-3.4.1/config.sub - Use arm-elf as a target name, this should solve your problem. Jean Tabel "Madhu.A.G." <madhu_ag...

vxworks powerpc cross compiler build error.
Hi, I'm trying to build a cross compiler for VxWorks with powerpc target. My build system is RH FC2. I get this error: /home/ju/new-gcc/gcc-2.95.3/objdir/gcc/xgcc -B/home/ju/new-gcc/gcc-2.95.3/objdir/gcc/ -B/home/ju/new-gcc/vxworks/powerpc-wrs-vxworks/bin/ -c -DHAVE_CONFIG_H -g -O2 -I. -I../../../libiberty/../include .../../../libiberty/fdmatch.c -o pic/fdmatch.o /home/ju/new-gcc/gcc-2.95.3/objdir/gcc/xgcc -B/home/ju/new-gcc/gcc-2.95.3/objdir/gcc/ -B/home/ju/new-gcc/vxworks/powerpc-wrs-vxworks/bin/ -c -DHAVE_CONFIG_H -g -O2 -I. -I../../../libiberty/../include ../../../libiberty/fdmatch...

Compilation errors with aCC compiler
Hi, I am getting compilation error in folloing situation: Here, I am giving sample piece of code. a.h: ------- extern int g_switch; ------ in "a.c", g_switch = 0; it is giving following error: Error 173: "a.c", line 19 # Redefined symbol 'g_switch'; previously defined at ["../../include/a.h", line 3]. But this code is working fine in all other systems like Suse, Solaris and Windows. System information : HP-UX C3600 B.11.00 U 9000/785 2003506592 unlimited-user license aCC version : aCC: HP ANSI C++ B3910B A.03.55 Please let me know if any c...

compiling plpython compilation error
Hi all. Im having a hard time trying to compile the plpython package. This is the error make gives me: gherzig@vdb:/usr/local/src/postgresql-8.2.5/src/pl/plpython> make gcc -O2 -Wall -Wmissing-prototypes -Wpointer-arith -Winline -Wdeclaration-after-statement -Wendif-labels -fno-strict-aliasing -fpic -shared -Wl,-soname,libplpython.so.0 plpython.o -L/usr/lib/python2.5/config -L../../../src/port -lpython2.5 -lpthread -ldl -lutil -lm -Wl,-rpath,'/usr/lib/python2.5/config' -o libplpython.so.0.0 /usr/lib64/gcc/x86_64-suse-linux/4.2.1/../../../../x86_64-suse-linux/bin/ld: /usr/lib...

Compiling a kernel... a compiler error!
OK, I am compiling a home-brew kernel. At the beginning, it was all Assembly, and ld.exe performed perfectly for linking. However,when I added some standard c code, I got an error which I can't resolve. First of all, here are my calls. BTW, NASM is the Assembly compiler: C:\djgpp\bin\gcc.exe -Wall -O -fstrength-reduce -fomit-frame-pointer -finline-functions -nostdinc -fno-builtin -I./include -c -o main.o main.c C:\Osdever\NASM\nasm.exe -f aout -o start.o start.asm C:\djgpp\bin\ld.exe -T link.ld -o kernel.bin start.o main.o And here is the error from gcc.exe: In file included from &l...

configure: error --- compile error
can u help me and guide a litte bit? please. [root@home cyrus-imapd-2.1.15]# ./configure creating cache ./config.cache checking host system type... i686-pc-linux-gnu checking for makedepend... /home/auser/cyrus-imapd-2.1.15/tools/not-mkdep configure: warning: Makedepend is not installed on this system. You should compile and install the version from the makedepend subdirectory. checking for gcc... gcc checking whether the C compiler (gcc ) works... yes checking whether the C compiler (gcc ) is a cross-compiler... no checking whether we are using GNU C... yes checking whether gcc accepts...

FFT error (compiler error?)
Hi, My FFT function suddenly stopped working, even trying a simple input it returns the following error: EDU>> fft(zeros(1,128)) libmwfftw: load error: dlsym(0x125219ba0, fftw_plan_guru64_dft): symbol not found Caught "std::exception" Exception message is: dlsym(0x125219ba0, fftw_plan_guru64_dft): symbol not found I'm running MATLAB 7.12.0 (R2011a), on a Mac OS X Version 10.7.5. Any idea how to fix this? I tried recompiling FFTW 3.3.3, but I still get the error. Cheers, Mathieu "Mathieu " <matt.turtles@gmail.com> wrote in message news:lcbp14$mjs$1@newscl01ah.mathworks.com... > Hi, > > My FFT function suddenly stopped working, even trying a simple input it > returns the following error: > > EDU>> fft(zeros(1,128)) > > libmwfftw: load error: dlsym(0x125219ba0, fftw_plan_guru64_dft): symbol > not found > Caught "std::exception" Exception message is: > dlsym(0x125219ba0, fftw_plan_guru64_dft): symbol not found > > I'm running MATLAB 7.12.0 (R2011a), on a Mac OS X Version 10.7.5. > > Any idea how to fix this? I tried recompiling FFTW 3.3.3, but I still get > the error. What change (if any) did you make to the system or to MATLAB between the last time that command worked and the first time it threw the error? Did you try changing the FFT library that MATLAB uses? [Your comment about recompiling FFTW suggests to me that you...

cross compile ok sample build errors
Hello I managed to cross compile wxwidgets 2.8.7 base on pc for an arm target: .../configure --host=arm-none-linux-gnueabi --target=arm-non-linux-gnueabi --build=i686-pc-cygwin --enable-monolithic --disable-shared --disable-gui --enable-optimise --disable-precomp-headers I now get strange errors when trying to build the example c:/wxWidgets-2.8.7/build-arm/lib\libwx_base-2.8-arm-none-linux-gnueabi.a(monolib_cmdline.o): In function `wxCmdLineParser::Parse(bool)':cmdline.cpp:(.text+0x40a0): undefined reference to `wxDateTime::ParseDate(char const*)' c:/wxWidgets-2.8.7/bui...

Re: bind 9 cross compilation error
> Hi all, > > I am a newbie to bind9. I have started cross compiling bind9 for my target > arm-linux platform and I keep getting some errors while configuring bind9. > > ./configure --target=arm-linux --host=i686-pc-linux-gnu > --prefix=/home/cm-x270/cmrootfs/ > BUILD_CC=/scratchbox/compilers/arm-gcc-3.3.4-glibc-2.3.2/bin/arm-linux-gcc > > configure: WARNING: If you wanted to set the --build type, don't use --host. > If a cross compiler is detected then cross compile mode will be used. > .... > checking for random device... /dev/random > checking for /dev/random... configure: error: cannot check for file existence > > when cross compiling > sara:/home/sara/bind-9.4.1# > > I have my host development x86 machine running linux and /scratchbox tool for > > cross compilation > (/scratchbox/compilers/arm-gcc-3.3.4-glibc-2.3.2/bin/arm-linux- ). > > Can anyone precise me how can I cross compile bind9 for my arm platform using > > scratchbox ? > > Thanks > Sara > ./configure .... --with-randomdev=<path> -- Mark Andrews, ISC 1 Seymour St., Dundas Valley, NSW 2117, Australia PHONE: +61 2 9871 4742 INTERNET: Mark_Andrews@isc.org ...

objc-class.h Protocol compile errors
Hi all, I'm not sure if this appropriate as it may be an XCode or Mac OS X specific issue. If this post is considered off-topic, I apologize. I'm trying to figure out a compile error I'm getting when trying to access the objc runtime functions. Basically, I'm taking an interpreter and trying to tie it to the runtime. I haven't gotten very far, but already have a head-scratcher on my hands. Essentially, I was going to test everything by trying to tie in the objc_lookUpClass function. As I understand it, this requires including the objc-runtime.h file (whic...

Compilation error while compile mysql
Hi If anyone can help me figure the following error so that i can get mysql installed. Any help would be greatly appreciated. Thanks in advance. source='sql_lex.cc' object='sql_lex.o' libtool=no \ depfile='.deps/sql_lex.Po' tmpdepfile='.deps/sql_lex.TPo' \ depmode=gcc3 /bin/bash ../depcomp \ gcc -DMYSQL_SERVER -DDEFAULT_MYSQL_HOME="\"/usr/local/mysql\"" -DDATADIR="\"/usr/local/mysql/var\"" -DSHAREDIR="\"/usr/local/mysql/share/mysql\"" -DHAVE_CONFIG_H -I. -I. -I.. -I../innobase/include -I./../includ...

Compilation error with seperate compilation
Can anyone help me with the following problem When i compile a program which is devided in three files and i compile with GCC i'm getting the follwong error However when i put it in one file it conpiles and runs perfectly So it has probaly something to do with the includes , but i do not see what Many regards Nico Heiligers **** Build of configuration Debug for project acc **** **** Internal Builder is used for build **** g++ -O0 -g3 -Wall -c -fmessage-length=0 -oreadadfile.o .. \readadfile.cpp In file included from ..\readadfile.cpp:1: ...\adfile.h:12: error: ISO C++ forbids declaration ...

Error in building Complete cross compiler for ARM
Iam getting error in building complete cross compiler for ARM The error is ERROR:No support for this host and target combination. This is the only one error iam getting. Iam using GCC version-3.4.1 Bin Utilities-2.15 Runtime C library-1.12 Please answer to my errors. Thanks in advance. ------Madhu ...

glibc
I'm trying to cross-compile glibc for PowerPC. I have ELDK 3, glibc-2.3.2 and Suse 9. The ELDK is working, I compiled Linux kernel with this ELDK. Coniguration is: .../configure --with-headers=/opt/ELDK3/ppc_8xx/usr/src/linux/include --without-fp --enable-add-ons --prefix=/temp/rootfs ppc-linux --build=i686-linux I have following error: ppc-linux-gcc ../sysdeps/unix/geteuid.S -c -I../include -I. -I/opt/ELDK3/ppc_8xx/usr/src/glibc2.3/glibc-2.3.2/compile/posix -I.. -I../libio -I/opt/ELDK3/ppc_8xx/usr/src/glibc2.3/glibc-2.3.2/compile -I../sysdeps/powerpc/powerpc32/elf -I....

Web resources about - cross compilation error - comp.protocols.kerberos

Other compilation albums of Westlife - Wikipedia, the free encyclopedia
The album consists of a range of well known hits, remixes, b-sides and international language versions. "Don't Calm The Storm" and "I Won't Let ...

Kate Moss Catwalk Compilation - YouTube
The one and only Kate Moss saunters down the catwalk. Footage circa 1994/1995. Designers include Gianni Versace, Anna Sui, Karl Lagerfeld and ...

Animals in Super Bowl Ads: Video Compilation - Special: Super Bowl - AdAge
Cheetahs and horses and bears, oh my! Spots featuring fuzzy, scaly and winged creatures are a time-honored tradition in the Super Bowl. Over ...

Instagram Spotlight Compilations to Shine More Frequently
Instagram launched curated content streams called Spotlight Compilations this past Halloween, and the Facebook-owned photo- and video-sharing ...

A compilation of people hurting themselves on their new Christmas Hoverboards
Hoverboards might not be safe or legal in all places, but they’re definitely popular gifts, especially around Christmas , but controlling these ...

Emperor X, members of Porches, Sorority Noise & many more contribute songs to new Bernie Sanders benefit ...
We're just a few days away from the Iowa Caucus, the real kickoff to primary season. Bernie Sanders has been getting a lot of support from musicians, ...

Compilation Of Bunnies Yawning
Submitted by: (via The Dodo ) Tagged: bunnies , yawning , compilation , bunny , Video Share on Facebook

Compilation: Curry's record-setting 128 3-pointers
... Login Search form Search 58° Navigation Home Giants A's Sharks Warriors Kings 49ers Raiders Quakes Insiders More Tickets Shop Watch Compilation: ...

A Compilation Of Every Time R2-D2 Saved The Day
This is a compilation of every time R2-D2 saves the day in the first six Star Wars movies. He deserves a medal. Without him, pretty much everybody ...

WATCH: New ISIS Video Is Compilation of Beheadings & Hand Amputations
In a new video purportedly released by the Islamic State, footage of previous violence committed by ISIS is set to…

Resources last updated: 3/10/2016 10:33:51 PM