f



[ace-bugs] Re: [ace-users] ACE

Hi,

        Thanks for using the PRF.

>> ACE VERSION: 5.4.1
>> 
>> HP Server and HP-UX 11.1
>> 
>> aCC: HP ANSI C++ B3910B A.03.37
>> 
>> CONTENTS OF $ACE_ROOT/ace/config.h : config-hpux-11.00.h
>> 
>> CONTENTS OF $ACE_ROOT/include/makeinclude/platform_macros.GNU :
>> platorm_hpux_aCC.GNU
>> 
>> AREA/CLASS/EXAMPLE AFFECTED:
>> 
>> $ACE_ROOT/ace - Compiled successfully but
>> 
>> $ACE_ROOT/  - failed to compile as shown below
>> 
>> Installing gperf -> /home/umitd/Projects/Trophy/lib/ACE_wrappers/bin
>> Installing gperf -> /home/umitd/Projects/Trophy/lib/ACE_wrappers/bin
>> gmake[6]: Leaving directory
>> `/home/umitd/Projects/Trophy/lib/ACE_wrappers/apps/g
>> perf/src'
>> cd tests && gmake -f Makefile all
>> gmake[6]: Entering directory
>> `/home/umitd/Projects/Trophy/lib/ACE_wrappers/apps/
>> gperf/tests'
>> 
>> Makefile:
>> /home/umitd/Projects/Trophy/lib/ACE_wrappers/apps/gperf/tests/Makefile
>> 
>> aCC -AA +W930 +W302 +DAportable -g -DACE_HAS_THREADS -D_REENTRANT
>> -D_RWSTD_MULTI
>> _THREAD -D_POSIX_C_SOURCE=199506L -D_HPUX_SOURCE -DHPUX_VERS=1111
>> -DACE_LACKS_PR
>> AGMA_ONCE   -I/home/umitd/Projects/Trophy/lib/ACE_wrappers
>> -DACE_HAS_EXCEPTIONS 
>> -D__ACE_INLINE__  -c -o .obj/test.o test.cpp
>> ../src/gperf -a -p -c -l -S1 -o ./c.gperf > cinset.cpp
>> 
>> Pid 23885 received a SIGSEGV for stack growth failure.
>> Possible causes: insufficient memory or swap space,
>> or stack size exceeded maxssiz. 

It looks to me like your OS is misconfigured to have a small stacksize
or you lack sufficient primary/secondary memory.  I recommend that you
check with your sysadmin to reconfigure your OS.

Thanks,

        Doug
        
        

>> /bin/sh: 23885 Memory fault(coredump)
>> gmake[6]: *** [cinset.cpp] Error 139
>> gmake[6]: Leaving directory
>> `/home/umitd/Projects/Trophy/lib/ACE_wrappers/apps/g
>> perf/tests'
>> gmake[5]: *** [tests.subdir] Error 2
>> gmake[5]: Leaving directory
>> `/home/umitd/Projects/Trophy/lib/ACE_wrappers/apps/g
>> perf'
>> gmake[4]: *** [all.nested] Error 2
>> gmake[4]: Leaving directory
>> `/home/umitd/Projects/Trophy/lib/ACE_wrappers/apps/g
>> perf'
>> gmake[3]: *** [gperf.subdir] Error 2
>> gmake[3]: Leaving directory
>> `/home/umitd/Projects/Trophy/lib/ACE_wrappers/apps'
>> gmake[2]: *** [all.nested] Error 2
>> gmake[2]: Leaving directory
>> `/home/umitd/Projects/Trophy/lib/ACE_wrappers/apps'
>> gmake[1]: *** [apps.subdir] Error 2
>> gmake[1]: Leaving directory `/home/umitd/Projects/Trophy/lib/ACE_wrappers'
>> gmake: *** [all.nested] Error 2
>> $ 
>> 
>> 
>> DOES THE PROBLEM AFFECT:
>> 
>> COMPILATION? YES
>> 
>> LINKING? NO
>> 
>> On Unix systems, did you run make realclean first? NO
>> 
>> EXECUTION? YES
>> 
>> OTHER (please specify)?
>> 
>> [Please indicate whether ACE, your application, or both are affected.] My
>> application affected
>> 
>> SYNOPSIS:
>> 
>> I have upgraded from ACE 5.3 to 5.4.1
>> 
>> When I compile my application wiht 5.4.1 it compiles fine. But when I
>> execute it, I get the following error. There is no problem with 5.3
>> 
>> Error:
>> 
>> $ TROPHYConsole
>> 
>> Pid 21466 received a SIGSEGV for stack growth failure.
>> Possible causes: insufficient memory or swap space,
>> or stack size exceeded maxssiz. 
>> Memory fault(coredump)
>> 
>> 
>> Baris SATIS 
>> THY-EBI  ISTANBUL 
>> Analyst Programmer 
>> Tel      : 212-6636300/7917 
>> GSM   : 532-7610113 
>> E-mail : bsatis@thy.com 
>> 
>>  
>> 
>> ------_=_NextPart_001_01C45E75.853D7B00
>> Content-Type: text/html
>> 
>> <!DOCTYPE HTML PUBLIC "-//W3C//DTD HTML 4.0 Transitional//EN">
>> <HTML><HEAD>
>> <META HTTP-EQUIV="Content-Type" CONTENT="text/html; charset=us-ascii">
>> <TITLE>Message</TITLE>
>> 
>> <META content="MSHTML 6.00.2800.1400" name=GENERATOR></HEAD>
>> <BODY>
>> <DIV>
>> <P><FONT face=Arial size=2>ACE VERSION: <STRONG>5.4.1</STRONG></FONT></P>
>> <P><FONT face=Arial><FONT size=2><STRONG><SPAN class=665440106-30062004>HP 
>> Server</SPAN>&nbsp;and&nbsp;<SPAN class=665440106-30062004>HP-UX 
>> 11.1</SPAN></STRONG></FONT></FONT></P>
>> <P><FONT face=Arial><FONT size=2><SPAN class=665440106-30062004><STRONG>aCC: HP 
>> ANSI C++ B3910B A.03.37</STRONG></SPAN></FONT></FONT></P>
>> <P><FONT face=Arial><FONT size=2>CONTENTS OF $ACE_ROOT/ace/config.h&nbsp;<SPAN 
>> class=665440106-30062004>: 
>> <STRONG>config-hpux-11.00.h</STRONG></SPAN></FONT></FONT></P>
>> <P><FONT face=Arial><FONT size=2>CONTENTS OF 
>> $ACE_ROOT/include/makeinclude/platform_macros.GNU&nbsp;<SPAN 
>> class=665440106-30062004>: 
>> <STRONG>platorm_hpux_aCC.GNU</STRONG></SPAN></FONT></FONT></P>
>> <P><FONT face=Arial size=2></FONT></P>
>> <P><FONT face=Arial size=2>AREA/CLASS/EXAMPLE AFFECTED:</FONT></P>
>> <P><FONT face=Arial size=2><SPAN class=665440106-30062004><STRONG>$ACE_ROOT/ace 
>> -&nbsp;Compiled successfully but</STRONG></SPAN></FONT></P>
>> <P><FONT face=Arial size=2><SPAN class=665440106-30062004><STRONG><SPAN 
>> class=665440106-30062004><STRONG>$ACE_ROOT/&nbsp; - </STRONG></SPAN>failed to 
>> compile as shown below</STRONG></SPAN></FONT></P>
>> <P><FONT face=Arial size=2><SPAN class=665440106-30062004><STRONG>Installing 
>> gperf -&gt; /home/umitd/Projects/Trophy/lib/ACE_wrappers/bin<BR>Installing gperf 
>> -&gt; /home/umitd/Projects/Trophy/lib/ACE_wrappers/bin<BR>gmake[6]: Leaving 
>> directory 
>> `/home/umitd/Projects/Trophy/lib/ACE_wrappers/apps/g<BR>perf/src'<BR>cd tests 
>> &amp;&amp; gmake -f Makefile all<BR>gmake[6]: Entering directory 
>> `/home/umitd/Projects/Trophy/lib/ACE_wrappers/apps/<BR>gperf/tests'</STRONG></SPAN></FONT></P>
>> <P><FONT face=Arial size=2><SPAN class=665440106-30062004><STRONG>Makefile: 
>> /home/umitd/Projects/Trophy/lib/ACE_wrappers/apps/gperf/tests/Makefile</STRONG></SPAN></FONT></P>
>> <P><FONT face=Arial size=2><SPAN class=665440106-30062004><STRONG>aCC -AA +W930 
>> +W302 +DAportable -g -DACE_HAS_THREADS -D_REENTRANT -D_RWSTD_MULTI<BR>_THREAD 
>> -D_POSIX_C_SOURCE=199506L -D_HPUX_SOURCE -DHPUX_VERS=1111 
>> -DACE_LACKS_PR<BR>AGMA_ONCE&nbsp;&nbsp; 
>> -I/home/umitd/Projects/Trophy/lib/ACE_wrappers -DACE_HAS_EXCEPTIONS 
>> <BR>-D__ACE_INLINE__&nbsp; -c -o .obj/test.o test.cpp<BR>../src/gperf -a -p -c 
>> -l -S1 -o ./c.gperf &gt; cinset.cpp</STRONG></SPAN></FONT></P>
>> <P><FONT face=Arial size=2><SPAN class=665440106-30062004><STRONG>Pid 23885 
>> received a SIGSEGV for stack growth failure.<BR>Possible causes: insufficient 
>> memory or swap space,<BR>or stack size exceeded maxssiz. <BR>/bin/sh: 23885 
>> Memory fault(coredump)<BR>gmake[6]: *** [cinset.cpp] Error 139<BR>gmake[6]: 
>> Leaving directory 
>> `/home/umitd/Projects/Trophy/lib/ACE_wrappers/apps/g<BR>perf/tests'<BR>gmake[5]: 
>> *** [tests.subdir] Error 2<BR>gmake[5]: Leaving directory 
>> `/home/umitd/Projects/Trophy/lib/ACE_wrappers/apps/g<BR>perf'<BR>gmake[4]: *** 
>> [all.nested] Error 2<BR>gmake[4]: Leaving directory 
>> `/home/umitd/Projects/Trophy/lib/ACE_wrappers/apps/g<BR>perf'<BR>gmake[3]: *** 
>> [gperf.subdir] Error 2<BR>gmake[3]: Leaving directory 
>> `/home/umitd/Projects/Trophy/lib/ACE_wrappers/apps'<BR>gmake[2]: *** 
>> [all.nested] Error 2<BR>gmake[2]: Leaving directory 
>> `/home/umitd/Projects/Trophy/lib/ACE_wrappers/apps'<BR>gmake[1]: *** 
>> [apps.subdir] Error 2<BR>gmake[1]: Leaving directory 
>> `/home/umitd/Projects/Trophy/lib/ACE_wrappers'<BR>gmake: *** [all.nested] Error 
>> 2<BR>$ <BR></STRONG></SPAN></FONT></P>
>> <P><FONT face=Arial size=2>DOES THE PROBLEM AFFECT:</FONT></P>
>> <P><FONT face=Arial><FONT size=2>COMPILATION?<SPAN class=665440106-30062004> 
>> <STRONG>YES</STRONG></SPAN></FONT></FONT></P>
>> <P><FONT face=Arial><FONT size=2>LINKING?<SPAN class=665440106-30062004> 
>> <STRONG>NO</STRONG></SPAN></FONT></FONT></P>
>> <P><FONT face=Arial><FONT size=2>On Unix systems, did you run make realclean 
>> first?<SPAN class=665440106-30062004> 
>> <STRONG>NO</STRONG></SPAN></FONT></FONT></P>
>> <P><FONT face=Arial><FONT size=2>EXECUTION?<SPAN class=665440106-30062004> 
>> <STRONG>YES</STRONG></SPAN></FONT></FONT></P>
>> <P><FONT face=Arial size=2>OTHER (please specify)?</FONT></P>
>> <P><FONT face=Arial><FONT size=2>[Please indicate whether ACE, your application, 
>> or both are affected.]<SPAN class=665440106-30062004> <STRONG>My application 
>> affected</STRONG></SPAN></FONT></FONT></P>
>> <P><FONT face=Arial size=2>SYNOPSIS:</FONT></P>
>> <P><FONT face=Arial size=2><SPAN class=665440106-30062004><STRONG>I have 
>> upgraded from ACE 5.3 to 5.4.1</STRONG></SPAN></FONT></P>
>> <P><FONT face=Arial size=2><SPAN class=665440106-30062004><STRONG>When I compile 
>> my application wiht 5.4.1 it compiles fine. But when I execute it, I get the 
>> following error. There is no problem with 5.3</STRONG></SPAN></FONT></P>
>> <P><FONT face=Arial size=2><SPAN 
>> class=665440106-30062004><STRONG>Error:</STRONG></SPAN></FONT></P>
>> <P><FONT face=Arial size=2><SPAN class=665440106-30062004><STRONG>$ 
>> TROPHYConsole</STRONG></SPAN></FONT></P>
>> <P><FONT face=Arial size=2><SPAN class=665440106-30062004><STRONG>Pid 21466 
>> received a SIGSEGV for stack growth failure.<BR>Possible causes: insufficient 
>> memory or swap space,<BR>or stack size exceeded maxssiz. <BR>Memory 
>> fault(coredump)<BR></STRONG></SPAN></FONT></P></DIV>
>> <P><B><FONT face="Arial TUR" size=2>Baris SATIS</FONT></B> <BR><FONT 
>> face="Arial TUR" size=2>THY-EBI&nbsp; ISTANBUL</FONT> <BR><FONT face="Arial TUR" 
>> size=2>Analyst Programmer</FONT> <BR><FONT face="Arial TUR" 
>> size=2>Tel&nbsp;&nbsp;&nbsp;&nbsp;&nbsp; : 212-6636300/7917</FONT> <BR><FONT 
>> face="Arial TUR" size=2>GSM&nbsp;&nbsp; : 532-7610113 </FONT><BR><FONT 
>> face="Arial TUR" size=2>E-mail : bsatis@thy.com</FONT> </P>
>> <DIV><FONT face=Arial size=2></FONT>&nbsp;</DIV></BODY></HTML>
>> 
>> ------_=_NextPart_001_01C45E75.853D7B00--
>> 
































































































































































































-- 
Dr. Douglas C. Schmidt, Professor           TEL: (615) 343-8197
Electrical Engineering and Computer Science FAX: (615) 343-7440
Vanderbilt University                       WEB: www.cs.wustl.edu/~schmidt/
Nashville, TN 37203                         NET: d.schmidt@vanderbilt.edu

0
Douglas
6/30/2004 11:01:42 PM
comp.soft-sys.ace 20326 articles. 1 followers. marlow.andrew (167) is leader. Post Follow

0 Replies
1347 Views

Similar Articles

[PageSpeed] 22

Reply: