f



[ace-users] Tests failed : ACE 5.5.2 - AIX 5.3 - GCC 4.1.1

Hi,
My first mail before my message in the group failed (my subscription was not 
activated).

The PRF below describes my problems. I can compile and link but several
ACE's tests fail.  I only use ACE library and only compile it by cd'ing in
the ace directory before running make. I already made some fixes described
below to compile and to link the library. I'm not abble to interpret the
faild tests to identify the problem source or area.

I didn't find the scoreboard before my mail. I see that several tests fails 
for
all compilations on AIX. I try to reassure myself by looking these results, 
it's
not only for my configuration. But it's a daily build with last development 
version.
For the 5.5.2 stable version they should probably not fail ?

Regards,
PO Houot.

ACE VERSION: 5.5.2

    HOST MACHINE and OPERATING SYSTEM:
bash-3.00$ uname -a
AIX localhost 3 5 0040983B4C00 unknown unknown AIX
bash-3.00$ oslevel -r
5300-05

    TARGET MACHINE and OPERATING SYSTEM, if different from HOST:
Same as host

    COMPILER NAME AND VERSION (AND PATCHLEVEL):
bash-3.00$ g++ -v
Using built-in specs.
Target: powerpc-ibm-aix5.3.0.0
Configured with: ../gcc-4.1.1/configure --disable-nls
Thread model: aix
gcc version 4.1.1

This compiler is installed from packages provided by UCLA AIX Software
library

    THE $ACE_ROOT/ace/config.h FILE :
bash-3.00$ more $ACE_ROOT/ace/config.h
#include "ace/config-aix-5.x.h"

    THE $ACE_ROOT/include/makeinclude/platform_macros.GNU FILE :
bash-3.00$ more $ACE_ROOT/include/makeinclude/platform_macros.GNU
include $(ACE_ROOT)/include/makeinclude/platform_aix_g++.GNU

    CONTENTS OF $ACE_ROOT/bin/MakeProjectCreator/config/default.features :
No such file

    AREA/CLASS/EXAMPLE AFFECTED:

    DOES THE PROBLEM AFFECT:
        COMPILATION?
First problem was :
Based_Pointer_Repository.cpp:118: error: duplicate explicit instantiation of
'ACE_Singleton<ACE_Based_Pointer_Repository, ACE_RW_Thread_Mutex>*
ACE_Singleton<ACE_Based_Pointer_Repository,
ACE_RW_Thread_Mutex>::singleton_'
Fixed with message
http://groups.google.fr/group/comp.soft-sys.ace/browse_thread/thread/aee9d3d172a59172/ea326c9c1e1fe3e0?lnk=gst&q=aix+gcc+4&rnum=3#ea326c9c1e1fe3e0
from Steve Huston.

Now many warnings about visibility
(options -fvisibility=hidden -fvisibility-inlines-hidden)
ace/String_Base.cpp:118: warning: visibility attribute not supported in this
configuration; ignored
This should probably no matter. I don't know

        LINKING?
First problem was :
ar cruv libACE.a.5.5.2 shr.o
BFD: shr.o: Unrecognized storage class 0 for *ABS* symbol
`/home/public/build/build-gcc-4.1.1/ACE_5.5/ACE_wrappers/ace/OS_NS_Thread.inl'
// Repeated many times
Fixed with this message
http://groups.google.fr/group/comp.soft-sys.ace/browse_thread/thread/c78c2c061a2f5d43/9b59f7d3cf34175f?lnk=st&q=&rnum=2&hl=fr#9b59f7d3cf34175f
from Randy Hammon

Now I only have several warnings (French version, means duplicated symbols)
ld : 0711-224 AVERTISSEMENT : Symbole thread_creds_t en double.
ld : 0711-224 AVERTISSEMENT : Symbole ras_arg_t en double.
ld : 0711-224 AVERTISSEMENT : Symbole fc_softc en double.
ld : 0711-224 AVERTISSEMENT : Symbole .global destructors keyed to
thread_creds_ten double.
ld : 0711-224 AVERTISSEMENT : Symbole .global constructors keyed to
thread_creds_ten double.
ld : 0711-224 AVERTISSEMENT : Symbole global constructors keyed to
thread_creds_ten double.
ld : 0711-224 AVERTISSEMENT : Symbole global destructors keyed to
thread_creds_ten double.
Does it affect my library ?

            On Unix systems, did you run make realclean first? yes

        EXECUTION?
Several tests fail, this is the list and an extract of the log files

auto_run_tests_finished: test/Based_Pointer_Test Time:1s Result:1
Error: (log/Based_Pointer_Test.log): MMAP pool mapping not present
Error: (log/Based_Pointer_Test.log): Persistent MMAP Memory Pool not mapped
Error: (log/Based_Pointer_Test.log): New base address not mapped after MMAP
remap

auto_run_tests: tests/Buffer_Stream_Test
ACE_ASSERT: file
/home/public/build/build-gcc-4.1.1/ACE_5.5/ACE_wrappers/ace/Module.cpp, line
256 assertion failed for 'task->thr_count () == 0'.Aborting...

auto_run_tests: tests/Bug_2368_Regression_Test
auto_run_tests_finished: test/Bug_2368_Regression_Test Time:1s Result:0
Error: (log/Bug_2368_Regression_Test.log): Handle close hasn't been called
for A
Error: (log/Bug_2368_Regression_Test.log): Handle close hasn't been called
for B

auto_run_tests: tests/Bug_2540_Regression_Test
ERROR: Bug_2540_Regression_Test timedout
Error: Bug_2540_Regression_Test FAILED (time out)
auto_run_tests_finished: test/Bug_2540_Regression_Test Time:401s Result:-1

auto_run_tests: tests/Conn_Test
ERROR: <Conn_Test> exited with coredump from signal 4 : ILL
auto_run_tests_finished: test/Conn_Test Time:3s Result:0
Error: Conn_Test dumped core
Error (log/Conn_Test.log): no line with 'Ending'
======= Begin Log File
Aug 23 16:48:30.812 2006@LM_DEBUG@(48868|1) Starting Conn_Test test at Wed
Aug 23 2006 16:48:30.812963
Aug 23 16:48:32.643 2006@LM_DEBUG@(48868|1) starting server at port 36413
Aug 23 16:48:32.688 2006@LM_DEBUG@(48868|258) **** starting timed-blocking
connect
Aug 23 16:48:32.689 2006@LM_DEBUG@(48868|258) opening Svc_Handler 20091a68
with handle 7
Aug 23 16:48:32.690 2006@LM_DEBUG@(48868|258) **** starting blocking connect
Aug 23 16:48:32.690 2006@LM_DEBUG@(48868|258) opening Svc_Handler 20091a68
with handle 7
Aug 23 16:48:32.691 2006@LM_DEBUG@(48868|258) **** starting cached blocking
connect
Aug 23 16:48:32.691 2006@LM_DEBUG@(53750|1) opening Svc_Handler 2006a4f8
with handle 7
Aug 23 16:48:32.693 2006@LM_DEBUG@(54468|1) opening Svc_Handler 2006a4f8
with handle 7
Aug 23 16:48:32.695 2006@LM_DEBUG@(53750|1) client localhost connected from
36414
Aug 23 16:48:32.696 2006@LM_DEBUG@(53750|1) reached end of input, connection
closed by client
Aug 23 16:48:32.696 2006@LM_DEBUG@(54468|1) client localhost connected from
36415
Aug 23 16:48:32.697 2006@LM_DEBUG@(54468|1) reached end of input, connection
closed by client
======= End Log File

auto_run_tests: tests/Future_Set_Test
ERROR: <Future_Set_Test> exited with coredump from signal 4 : ILL
auto_run_tests_finished: test/Future_Set_Test Time:2s Result:0
Error: Future_Set_Test dumped core
Error (log/Future_Set_Test.log): no line with 'Ending'
======= Begin Log File
Aug 23 16:48:44.672 2006@LM_DEBUG@(48890|1) Starting Future_Set_Test test at
Wed Aug 23 2006 16:48:44.672866
Aug 23 16:48:44.673 2006@LM_DEBUG@(1) Prime_Scheduler andres created
..... Too long

auto_run_tests: tests/Future_Test
ERROR: <Future_Test> exited with coredump from signal 4 : ILL
auto_run_tests_finished: test/Future_Test Time:1s Result:0
Error: Future_Test dumped core
Error (log/Future_Test.log): no line with 'Ending'
======= Begin Log File
Aug 23 16:48:46.870 2006@LM_DEBUG@(56818|1) Starting Future_Test test at Wed
Aug 23 2006 16:48:46.870494
..... Too long

auto_run_tests: tests/MT_Reference_Counted_Event_Handler_Test
ACE_ASSERT: file MT_Reference_Counted_Event_Handler_Test.cpp, line 832
assertion failed for 'result == 0'.Aborting...

auto_run_tests: tests/MT_Reference_Counted_Notify_Test
ERROR: <MT_Reference_Counted_Notify_Test> exited with coredump from signal 4
: ILL
auto_run_tests_finished: test/MT_Reference_Counted_Notify_Test Time:3s
Result:0
Error: MT_Reference_Counted_Notify_Test dumped core
Error (log/MT_Reference_Counted_Notify_Test.log): no line with 'Ending'
======= Begin Log File
Aug 23 16:50:23.495 2006@LM_DEBUG@(56438|1) Starting
MT_Reference_Counted_Notify_Test test at Wed Aug 23 2006 16:50:23.496013
Aug 23 16:50:23.496 2006@LM_DEBUG@

Testing Select Reactor....

Aug 23 16:50:23.496 2006@LM_DEBUG@

Testing empty notifies...

Aug 23 16:50:23.512 2006@LM_DEBUG@Event Loop iteration 1....
Aug 23 16:50:24.013 2006@LM_DEBUG@Event Loop iteration 2....
Aug 23 16:50:24.513 2006@LM_DEBUG@Event Loop iteration 3....
Aug 23 16:50:25.013 2006@LM_DEBUG@Event Loop iteration 4....
Aug 23 16:50:25.513 2006@LM_DEBUG@Event Loop iteration 5....
======= End Log File

auto_run_tests: tests/Message_Block_Test
ERROR: <Message_Block_Test> exited with coredump from signal 4 : ILL
auto_run_tests_finished: test/Message_Block_Test Time:1s Result:0
Error: Message_Block_Test dumped core
Error (log/Message_Block_Test.log): no line with 'Ending'
======= Begin Log File
Aug 23 16:52:00.745 2006@LM_DEBUG@(55460|1) Starting Message_Block_Test test
at Wed Aug 23 2006 16:52:0
0.745814
Aug 23 16:52:00.746 2006@LM_DEBUG@(1) threads = 4
Aug 23 16:52:00.746 2006@LM_DEBUG@(1) Start Message_Block_Test using Default
allocation strategy
Aug 23 16:52:00.748 2006@LM_DEBUG@(515) starting svc() method
Aug 23 16:52:00.748 2006@LM_DEBUG@(258) starting svc() method
Aug 23 16:52:00.748 2006@LM_DEBUG@
(1) sending shutdown message
Aug 23 16:52:00.748 2006@LM_DEBUG@
(1) end producer
Aug 23 16:52:00.748 2006@LM_DEBUG@(1) waiting for worker tasks to finish...
Aug 23 16:52:00.748 2006@LM_DEBUG@(1) destroying worker tasks
======= End Log File

auto_run_tests: tests/Message_Queue_Test
auto_run_tests_finished: test/Message_Queue_Test Time:1s Result:0
Error: (log/Message_Queue_Test.log): enqueue: Invalid argument
Error: (log/Message_Queue_Test.log): dequeue_head: Invalid argument

auto_run_tests: tests/Message_Queue_././Message_Queue_Test_Ex
ERROR: <Message_Queue_Test_Ex> exited with coredump from signal 11 : SEGV
auto_run_tests_finished: test/Message_Queue_Test_Ex Time:1s Result:0
Error: Message_Queue_Test_Ex dumped core
Error (log/Message_Queue_Test_Ex.log): no line with 'Ending'
======= Begin Log File
Aug 23 16:52:03.811 2006@LM_DEBUG@(55466|1) Starting Message_Queue_Test_Ex
test at Wed Aug 23 2006 16:52:03.811960
Aug 23 16:52:03.814 2006@LM_DEBUG@Timed dequeue test: OK
Aug 23 16:52:03.858 2006@LM_INFO@ACE_Message_Queue_Ex<ACE_NULL_SYNCH>,
single thread: 10000 messages took 33 msec (0.003300 msec/message)
Aug 23 16:52:03.877 2006@LM_INFO@ACE_Message_Queue_Ex<ACE_SYNCH>: 10000
messages took 3152383431 msec (315238.343100 msec/message)
======= End Log File

auto_run_tests: tests/Process_Manual_Event_Test
ERROR: Process_Manual_Event_Test timedout
Error: Process_Manual_Event_Test FAILED (time out)
auto_run_tests_finished: test/Process_Manual_Event_Test Time:400s Result:-1
Error (log/Process_Manual_Event_Test.log): no line with 'Ending'
======= Begin Log File
Aug 23 16:52:44.365 2006@LM_DEBUG@(53186|1) Starting
Process_Manual_Event_Test test at Wed Aug 23 2006 16:52:44.365994
Aug 23 16:52:44.382 2006@LM_DEBUG@Parent spawned child process with pid =
57384.
Aug 23 16:52:44.383 2006@LM_DEBUG@(53186) Begin ping-pong
Aug 23 16:52:44.384 2006@LM_DEBUG@(53186) Ping
======= End Log File
Error (Process_Manual_Event_Test-child.log): no line with 'Ending'
Error (Process_Manual_Event_Test-child.log): Number of 'Starting' does not
match number of 'Ending' (1!= 0)
======= Begin Sublog File Process_Manual_Event_Test-child.log
Aug 23 16:52:44.384 2006@LM_DEBUG@(57384|1) Starting
Process_Manual_Event_Test-child test at Wed Aug 23
 2006 16:52:44.384052
Aug 23 16:52:44.384 2006@LM_DEBUG@(57384) Begin ping-pong
Aug 23 16:52:44.384 2006@LM_DEBUG@(57384) Pong
======= End Sublog File

auto_run_tests: tests/Recursive_Condition_Test
auto_run_tests_finished: test/Recursive_Condition_Test Time:20s Result:0
Error: (log/Recursive_Condition_Test.log): (258) waiter found protected_int
1
Error: (log/Recursive_Condition_Test.log): (515) waiter found protected_int
1
Error: (log/Recursive_Condition_Test.log): (772) waiter found protected_int
3
Error: (log/Recursive_Condition_Test.log): (1029) waiter found protected_int
3
Error: (log/Recursive_Condition_Test.log): (1286) waiter found protected_int
3
Error: (log/Recursive_Condition_Test.log): (1543) waiter found protected_int
3

auto_run_tests: tests/Signal_Test
auto_run_tests_finished: test/Signal_Test Time:3s Result:0
Error (Signal_Test-child.log): Number of 'Starting' does not match number of
'Ending' (3 != 2)
======= Begin Sublog File Signal_Test-child.log
Aug 23 17:01:36.923 2006@LM_DEBUG@(59354|1) Starting Signal_Test-child test
at Wed Aug 23 2006 17:01:36.923201
Aug 23 17:01:36.923 2006@LM_DEBUG@(59354|1) **** test 1: handle signals
synchronously in separate thread
Aug 23 17:01:36.923 2006@LM_DEBUG@(59354|1) spawning worker thread
Aug 23 17:01:36.924 2006@LM_DEBUG@(59354|1) spawning signal handler thread
Aug 23 17:01:36.924 2006@LM_DEBUG@(59354|1) Ending Signal_Test-child test at
Wed Aug 23 2006 17:01:36.924462

Aug 23 17:01:36.933 2006@LM_DEBUG@(19328|1) Starting Signal_Test-child test
at Wed Aug 23 2006 17:01:36.933329
Aug 23 17:01:36.933 2006@LM_DEBUG@(19328|1) **** test 2: handle signals
synchronously in this thread
Aug 23 17:01:36.933 2006@LM_DEBUG@(19328|1) spawning worker thread
Aug 23 17:01:36.940 2006@LM_DEBUG@(19328|258) sleeping for 2 seconds
Aug 23 17:01:38.940 2006@LM_DEBUG@(19328|258) sending SIGHUP to parent
process 59106
Aug 23 17:01:38.940 2006@LM_DEBUG@(19328|258) sleeping for 2 seconds
Aug 23 17:01:38.952 2006@LM_DEBUG@(19328|1) synchronous signal handler done
Aug 23 17:01:38.952 2006@LM_DEBUG@(19328|1) Ending Signal_Test-child test at
Wed Aug 23 2006 17:01:38.952947

Aug 23 17:01:38.961 2006@LM_DEBUG@(59356|1) Starting Signal_Test-child test
at Wed Aug 23 2006 17:01:38.961491
Aug 23 17:01:38.961 2006@LM_DEBUG@(59356|1) **** test 3: handle signals
asynchronously in this thread
Aug 23 17:01:38.961 2006@LM_DEBUG@(59356|1) sleeping for 2 seconds
======= End Sublog File

auto_run_tests: tests/SOCK_Connector_Test
auto_run_tests_finished: test/SOCK_Connector_Test Time:1s Result:0
Warning: (log/SOCK_Connector_Test.log): Immediate success/fail; test not
completed
======= Begin Log File
Aug 23 17:01:39.936 2006@LM_DEBUG@(59108|1) Starting SOCK_Connector_Test
test at Wed Aug 23 2006 17:01:39.936512
Aug 23 17:01:39.942 2006@LM_DEBUG@Testing to host "localhost"
Aug 23 17:01:39.944 2006@LM_DEBUG@Proper fail: Connection refused
Aug 23 17:01:39.944 2006@LM_DEBUG@Testing to host "localhost", port 7
Aug 23 17:01:39.944 2006@LM_WARNING@Immediate success/fail; test not
completed
Aug 23 17:01:39.944 2006@LM_DEBUG@(59108|1) Ending SOCK_Connector_Test test
at Wed Aug 23 2006 17:01:39.944501

auto_run_tests: tests/Thread_Pool_Reactor_Resume_Test
terminate called after throwing an instance of 'std::ios_base::failure'
  what():  basic_ios::clear
auto_run_tests_finished: test/Thread_Pool_Reactor_Resume_Test Time:4s
Result:0
Error: Thread_Pool_Reactor_Resume_Test dumped core

auto_run_tests: tests/Thread_Pool_Reactor_Test
terminate called after throwing an instance of 'std::ios_base::failure'
  what():  basic_ios::clear
auto_run_tests_finished: test/Thread_Pool_Reactor_Test Time:4s Result:0
Error: Thread_Pool_Reactor_Test dumped core

auto_run_tests: tests/Recursive_Condition_Bug_Test
ERROR: <Recursive_Condition_Bug_Test> exited with coredump from signal 4 :
ILL
auto_run_tests_finished: test/Recursive_Condition_Bug_Test Time:1s Result:0
Error: Recursive_Condition_Bug_Test dumped core


        OTHER (please specify)?

    SYNOPSIS:

    DESCRIPTION:

    REPEAT BY:
Each time the tests are executed with run_test.pl

    SAMPLE FIX/WORKAROUND:
None
Hi,
The PRF below describes my problems. I can compile and link but several
ACE's tests fail.  I only use ACE library and only compile it by cd'ing in
the ace directory before running make. I already made some fixes described
below to compile and to link the library. I'm not abble to interpret the
faild tests to identify the problem source or area.

Regards,
PO Houot.

ACE VERSION: 5.5.2

    HOST MACHINE and OPERATING SYSTEM:
bash-3.00$ uname -a
AIX localhost 3 5 0040983B4C00 unknown unknown AIX
bash-3.00$ oslevel -r
5300-05

    TARGET MACHINE and OPERATING SYSTEM, if different from HOST:
Same as host

    COMPILER NAME AND VERSION (AND PATCHLEVEL):
bash-3.00$ g++ -v
Using built-in specs.
Target: powerpc-ibm-aix5.3.0.0
Configured with: ../gcc-4.1.1/configure --disable-nls
Thread model: aix
gcc version 4.1.1

This compiler is installed from packages provided by UCLA AIX Software
library

    THE $ACE_ROOT/ace/config.h FILE :
bash-3.00$ more $ACE_ROOT/ace/config.h
#include "ace/config-aix-5.x.h"

    THE $ACE_ROOT/include/makeinclude/platform_macros.GNU FILE :
bash-3.00$ more $ACE_ROOT/include/makeinclude/platform_macros.GNU
include $(ACE_ROOT)/include/makeinclude/platform_aix_g++.GNU

    CONTENTS OF $ACE_ROOT/bin/MakeProjectCreator/config/default.features :
No such file

    AREA/CLASS/EXAMPLE AFFECTED:

    DOES THE PROBLEM AFFECT:
        COMPILATION?
First problem was :
Based_Pointer_Repository.cpp:118: error: duplicate explicit instantiation of
'ACE_Singleton<ACE_Based_Pointer_Repository, ACE_RW_Thread_Mutex>*
ACE_Singleton<ACE_Based_Pointer_Repository,
ACE_RW_Thread_Mutex>::singleton_'
Fixed with message
http://groups.google.fr/group/comp.soft-sys.ace/browse_thread/thread/aee9d3d172a59172/ea326c9c1e1fe3e0?lnk=gst&q=aix+gcc+4&rnum=3#ea326c9c1e1fe3e0
from Steve Huston.

Now many warnings about visibility
(options -fvisibility=hidden -fvisibility-inlines-hidden)
ace/String_Base.cpp:118: warning: visibility attribute not supported in this
configuration; ignored
This should probably no matter. I don't know

        LINKING?
First problem was :
ar cruv libACE.a.5.5.2 shr.o
BFD: shr.o: Unrecognized storage class 0 for *ABS* symbol
`/home/public/build/build-gcc-4.1.1/ACE_5.5/ACE_wrappers/ace/OS_NS_Thread.inl'
// Repeated many times
Fixed with this message
http://groups.google.fr/group/comp.soft-sys.ace/browse_thread/thread/c78c2c061a2f5d43/9b59f7d3cf34175f?lnk=st&q=&rnum=2&hl=fr#9b59f7d3cf34175f
from Randy Hammon

Now I only have several warnings (French version, means duplicated symbols)
ld : 0711-224 AVERTISSEMENT : Symbole thread_creds_t en double.
ld : 0711-224 AVERTISSEMENT : Symbole ras_arg_t en double.
ld : 0711-224 AVERTISSEMENT : Symbole fc_softc en double.
ld : 0711-224 AVERTISSEMENT : Symbole .global destructors keyed to
thread_creds_ten double.
ld : 0711-224 AVERTISSEMENT : Symbole .global constructors keyed to
thread_creds_ten double.
ld : 0711-224 AVERTISSEMENT : Symbole global constructors keyed to
thread_creds_ten double.
ld : 0711-224 AVERTISSEMENT : Symbole global destructors keyed to
thread_creds_ten double.
Does it affect my library ?

            On Unix systems, did you run make realclean first? yes

        EXECUTION?
Several tests fail, this is the list and an extract of the log files

auto_run_tests_finished: test/Based_Pointer_Test Time:1s Result:1
Error: (log/Based_Pointer_Test.log): MMAP pool mapping not present
Error: (log/Based_Pointer_Test.log): Persistent MMAP Memory Pool not mapped
Error: (log/Based_Pointer_Test.log): New base address not mapped after MMAP
remap

auto_run_tests: tests/Buffer_Stream_Test
ACE_ASSERT: file
/home/public/build/build-gcc-4.1.1/ACE_5.5/ACE_wrappers/ace/Module.cpp, line
256 assertion failed for 'task->thr_count () == 0'.Aborting...

auto_run_tests: tests/Bug_2368_Regression_Test
auto_run_tests_finished: test/Bug_2368_Regression_Test Time:1s Result:0
Error: (log/Bug_2368_Regression_Test.log): Handle close hasn't been called
for A
Error: (log/Bug_2368_Regression_Test.log): Handle close hasn't been called
for B

auto_run_tests: tests/Bug_2540_Regression_Test
ERROR: Bug_2540_Regression_Test timedout
Error: Bug_2540_Regression_Test FAILED (time out)
auto_run_tests_finished: test/Bug_2540_Regression_Test Time:401s Result:-1

auto_run_tests: tests/Conn_Test
ERROR: <Conn_Test> exited with coredump from signal 4 : ILL
auto_run_tests_finished: test/Conn_Test Time:3s Result:0
Error: Conn_Test dumped core
Error (log/Conn_Test.log): no line with 'Ending'
======= Begin Log File
Aug 23 16:48:30.812 2006@LM_DEBUG@(48868|1) Starting Conn_Test test at Wed
Aug 23 2006 16:48:30.812963
Aug 23 16:48:32.643 2006@LM_DEBUG@(48868|1) starting server at port 36413
Aug 23 16:48:32.688 2006@LM_DEBUG@(48868|258) **** starting timed-blocking
connect
Aug 23 16:48:32.689 2006@LM_DEBUG@(48868|258) opening Svc_Handler 20091a68
with handle 7
Aug 23 16:48:32.690 2006@LM_DEBUG@(48868|258) **** starting blocking connect
Aug 23 16:48:32.690 2006@LM_DEBUG@(48868|258) opening Svc_Handler 20091a68
with handle 7
Aug 23 16:48:32.691 2006@LM_DEBUG@(48868|258) **** starting cached blocking
connect
Aug 23 16:48:32.691 2006@LM_DEBUG@(53750|1) opening Svc_Handler 2006a4f8
with handle 7
Aug 23 16:48:32.693 2006@LM_DEBUG@(54468|1) opening Svc_Handler 2006a4f8
with handle 7
Aug 23 16:48:32.695 2006@LM_DEBUG@(53750|1) client localhost connected from
36414
Aug 23 16:48:32.696 2006@LM_DEBUG@(53750|1) reached end of input, connection
closed by client
Aug 23 16:48:32.696 2006@LM_DEBUG@(54468|1) client localhost connected from
36415
Aug 23 16:48:32.697 2006@LM_DEBUG@(54468|1) reached end of input, connection
closed by client
======= End Log File

auto_run_tests: tests/Future_Set_Test
ERROR: <Future_Set_Test> exited with coredump from signal 4 : ILL
auto_run_tests_finished: test/Future_Set_Test Time:2s Result:0
Error: Future_Set_Test dumped core
Error (log/Future_Set_Test.log): no line with 'Ending'
======= Begin Log File
Aug 23 16:48:44.672 2006@LM_DEBUG@(48890|1) Starting Future_Set_Test test at
Wed Aug 23 2006 16:48:44.672866
Aug 23 16:48:44.673 2006@LM_DEBUG@(1) Prime_Scheduler andres created
..... Too long

auto_run_tests: tests/Future_Test
ERROR: <Future_Test> exited with coredump from signal 4 : ILL
auto_run_tests_finished: test/Future_Test Time:1s Result:0
Error: Future_Test dumped core
Error (log/Future_Test.log): no line with 'Ending'
======= Begin Log File
Aug 23 16:48:46.870 2006@LM_DEBUG@(56818|1) Starting Future_Test test at Wed
Aug 23 2006 16:48:46.870494
..... Too long

auto_run_tests: tests/MT_Reference_Counted_Event_Handler_Test
ACE_ASSERT: file MT_Reference_Counted_Event_Handler_Test.cpp, line 832
assertion failed for 'result == 0'.Aborting...

auto_run_tests: tests/MT_Reference_Counted_Notify_Test
ERROR: <MT_Reference_Counted_Notify_Test> exited with coredump from signal 4
: ILL
auto_run_tests_finished: test/MT_Reference_Counted_Notify_Test Time:3s
Result:0
Error: MT_Reference_Counted_Notify_Test dumped core
Error (log/MT_Reference_Counted_Notify_Test.log): no line with 'Ending'
======= Begin Log File
Aug 23 16:50:23.495 2006@LM_DEBUG@(56438|1) Starting
MT_Reference_Counted_Notify_Test test at Wed Aug 23 2006 16:50:23.496013
Aug 23 16:50:23.496 2006@LM_DEBUG@

Testing Select Reactor....

Aug 23 16:50:23.496 2006@LM_DEBUG@

Testing empty notifies...

Aug 23 16:50:23.512 2006@LM_DEBUG@Event Loop iteration 1....
Aug 23 16:50:24.013 2006@LM_DEBUG@Event Loop iteration 2....
Aug 23 16:50:24.513 2006@LM_DEBUG@Event Loop iteration 3....
Aug 23 16:50:25.013 2006@LM_DEBUG@Event Loop iteration 4....
Aug 23 16:50:25.513 2006@LM_DEBUG@Event Loop iteration 5....
======= End Log File

auto_run_tests: tests/Message_Block_Test
ERROR: <Message_Block_Test> exited with coredump from signal 4 : ILL
auto_run_tests_finished: test/Message_Block_Test Time:1s Result:0
Error: Message_Block_Test dumped core
Error (log/Message_Block_Test.log): no line with 'Ending'
======= Begin Log File
Aug 23 16:52:00.745 2006@LM_DEBUG@(55460|1) Starting Message_Block_Test test
at Wed Aug 23 2006 16:52:0
0.745814
Aug 23 16:52:00.746 2006@LM_DEBUG@(1) threads = 4
Aug 23 16:52:00.746 2006@LM_DEBUG@(1) Start Message_Block_Test using Default
allocation strategy
Aug 23 16:52:00.748 2006@LM_DEBUG@(515) starting svc() method
Aug 23 16:52:00.748 2006@LM_DEBUG@(258) starting svc() method
Aug 23 16:52:00.748 2006@LM_DEBUG@
(1) sending shutdown message
Aug 23 16:52:00.748 2006@LM_DEBUG@
(1) end producer
Aug 23 16:52:00.748 2006@LM_DEBUG@(1) waiting for worker tasks to finish...
Aug 23 16:52:00.748 2006@LM_DEBUG@(1) destroying worker tasks
======= End Log File

auto_run_tests: tests/Message_Queue_Test
auto_run_tests_finished: test/Message_Queue_Test Time:1s Result:0
Error: (log/Message_Queue_Test.log): enqueue: Invalid argument
Error: (log/Message_Queue_Test.log): dequeue_head: Invalid argument

auto_run_tests: tests/Message_Queue_././Message_Queue_Test_Ex
ERROR: <Message_Queue_Test_Ex> exited with coredump from signal 11 : SEGV
auto_run_tests_finished: test/Message_Queue_Test_Ex Time:1s Result:0
Error: Message_Queue_Test_Ex dumped core
Error (log/Message_Queue_Test_Ex.log): no line with 'Ending'
======= Begin Log File
Aug 23 16:52:03.811 2006@LM_DEBUG@(55466|1) Starting Message_Queue_Test_Ex
test at Wed Aug 23 2006 16:52:03.811960
Aug 23 16:52:03.814 2006@LM_DEBUG@Timed dequeue test: OK
Aug 23 16:52:03.858 2006@LM_INFO@ACE_Message_Queue_Ex<ACE_NULL_SYNCH>,
single thread: 10000 messages took 33 msec (0.003300 msec/message)
Aug 23 16:52:03.877 2006@LM_INFO@ACE_Message_Queue_Ex<ACE_SYNCH>: 10000
messages took 3152383431 msec (315238.343100 msec/message)
======= End Log File

auto_run_tests: tests/Process_Manual_Event_Test
ERROR: Process_Manual_Event_Test timedout
Error: Process_Manual_Event_Test FAILED (time out)
auto_run_tests_finished: test/Process_Manual_Event_Test Time:400s Result:-1
Error (log/Process_Manual_Event_Test.log): no line with 'Ending'
======= Begin Log File
Aug 23 16:52:44.365 2006@LM_DEBUG@(53186|1) Starting
Process_Manual_Event_Test test at Wed Aug 23 2006 16:52:44.365994
Aug 23 16:52:44.382 2006@LM_DEBUG@Parent spawned child process with pid =
57384.
Aug 23 16:52:44.383 2006@LM_DEBUG@(53186) Begin ping-pong
Aug 23 16:52:44.384 2006@LM_DEBUG@(53186) Ping
======= End Log File
Error (Process_Manual_Event_Test-child.log): no line with 'Ending'
Error (Process_Manual_Event_Test-child.log): Number of 'Starting' does not
match number of 'Ending' (1!= 0)
======= Begin Sublog File Process_Manual_Event_Test-child.log
Aug 23 16:52:44.384 2006@LM_DEBUG@(57384|1) Starting
Process_Manual_Event_Test-child test at Wed Aug 23
 2006 16:52:44.384052
Aug 23 16:52:44.384 2006@LM_DEBUG@(57384) Begin ping-pong
Aug 23 16:52:44.384 2006@LM_DEBUG@(57384) Pong
======= End Sublog File

auto_run_tests: tests/Recursive_Condition_Test
auto_run_tests_finished: test/Recursive_Condition_Test Time:20s Result:0
Error: (log/Recursive_Condition_Test.log): (258) waiter found protected_int
1
Error: (log/Recursive_Condition_Test.log): (515) waiter found protected_int
1
Error: (log/Recursive_Condition_Test.log): (772) waiter found protected_int
3
Error: (log/Recursive_Condition_Test.log): (1029) waiter found protected_int
3
Error: (log/Recursive_Condition_Test.log): (1286) waiter found protected_int
3
Error: (log/Recursive_Condition_Test.log): (1543) waiter found protected_int
3

auto_run_tests: tests/Signal_Test
auto_run_tests_finished: test/Signal_Test Time:3s Result:0
Error (Signal_Test-child.log): Number of 'Starting' does not match number of
'Ending' (3 != 2)
======= Begin Sublog File Signal_Test-child.log
Aug 23 17:01:36.923 2006@LM_DEBUG@(59354|1) Starting Signal_Test-child test
at Wed Aug 23 2006 17:01:36.923201
Aug 23 17:01:36.923 2006@LM_DEBUG@(59354|1) **** test 1: handle signals
synchronously in separate thread
Aug 23 17:01:36.923 2006@LM_DEBUG@(59354|1) spawning worker thread
Aug 23 17:01:36.924 2006@LM_DEBUG@(59354|1) spawning signal handler thread
Aug 23 17:01:36.924 2006@LM_DEBUG@(59354|1) Ending Signal_Test-child test at
Wed Aug 23 2006 17:01:36.924462

Aug 23 17:01:36.933 2006@LM_DEBUG@(19328|1) Starting Signal_Test-child test
at Wed Aug 23 2006 17:01:36.933329
Aug 23 17:01:36.933 2006@LM_DEBUG@(19328|1) **** test 2: handle signals
synchronously in this thread
Aug 23 17:01:36.933 2006@LM_DEBUG@(19328|1) spawning worker thread
Aug 23 17:01:36.940 2006@LM_DEBUG@(19328|258) sleeping for 2 seconds
Aug 23 17:01:38.940 2006@LM_DEBUG@(19328|258) sending SIGHUP to parent
process 59106
Aug 23 17:01:38.940 2006@LM_DEBUG@(19328|258) sleeping for 2 seconds
Aug 23 17:01:38.952 2006@LM_DEBUG@(19328|1) synchronous signal handler done
Aug 23 17:01:38.952 2006@LM_DEBUG@(19328|1) Ending Signal_Test-child test at
Wed Aug 23 2006 17:01:38.952947

Aug 23 17:01:38.961 2006@LM_DEBUG@(59356|1) Starting Signal_Test-child test
at Wed Aug 23 2006 17:01:38.961491
Aug 23 17:01:38.961 2006@LM_DEBUG@(59356|1) **** test 3: handle signals
asynchronously in this thread
Aug 23 17:01:38.961 2006@LM_DEBUG@(59356|1) sleeping for 2 seconds
======= End Sublog File

auto_run_tests: tests/SOCK_Connector_Test
auto_run_tests_finished: test/SOCK_Connector_Test Time:1s Result:0
Warning: (log/SOCK_Connector_Test.log): Immediate success/fail; test not
completed
======= Begin Log File
Aug 23 17:01:39.936 2006@LM_DEBUG@(59108|1) Starting SOCK_Connector_Test
test at Wed Aug 23 2006 17:01:39.936512
Aug 23 17:01:39.942 2006@LM_DEBUG@Testing to host "localhost"
Aug 23 17:01:39.944 2006@LM_DEBUG@Proper fail: Connection refused
Aug 23 17:01:39.944 2006@LM_DEBUG@Testing to host "localhost", port 7
Aug 23 17:01:39.944 2006@LM_WARNING@Immediate success/fail; test not
completed
Aug 23 17:01:39.944 2006@LM_DEBUG@(59108|1) Ending SOCK_Connector_Test test
at Wed Aug 23 2006 17:01:39.944501

auto_run_tests: tests/Thread_Pool_Reactor_Resume_Test
terminate called after throwing an instance of 'std::ios_base::failure'
  what():  basic_ios::clear
auto_run_tests_finished: test/Thread_Pool_Reactor_Resume_Test Time:4s
Result:0
Error: Thread_Pool_Reactor_Resume_Test dumped core

auto_run_tests: tests/Thread_Pool_Reactor_Test
terminate called after throwing an instance of 'std::ios_base::failure'
  what():  basic_ios::clear
auto_run_tests_finished: test/Thread_Pool_Reactor_Test Time:4s Result:0
Error: Thread_Pool_Reactor_Test dumped core

auto_run_tests: tests/Recursive_Condition_Bug_Test
ERROR: <Recursive_Condition_Bug_Test> exited with coredump from signal 4 :
ILL
auto_run_tests_finished: test/Recursive_Condition_Bug_Test Time:1s Result:0
Error: Recursive_Condition_Bug_Test dumped core


        OTHER (please specify)?

    SYNOPSIS:

    DESCRIPTION:

    REPEAT BY:
Each time the tests are executed with run_test.pl

    SAMPLE FIX/WORKAROUND:
None 


0
Pierre
8/24/2006 5:50:40 AM
comp.soft-sys.ace 20326 articles. 1 followers. marlow.andrew (167) is leader. Post Follow

0 Replies
1370 Views

Similar Articles

[PageSpeed] 21

Reply: