f



RE: [ace-users] compiling issue on Sun 5.8 with ACE 5.3 #2 #2

This is a multi-part message in MIME format.

------=_NextPart_000_00A2_01C34B9F.E5ADED10
Content-Type: multipart/alternative;
	boundary="----=_NextPart_001_00A3_01C34B9F.E5ADED10"


------=_NextPart_001_00A3_01C34B9F.E5ADED10
Content-Type: text/plain;
	charset="us-ascii"
Content-Transfer-Encoding: 7bit

Can you please also lookint to the following error as well:
 
 
Compiling /v/sbansal/out/temp/playground/ExecAgent.o
/opt/SUNWspro/bin/CC -temp=/v/sbansal/out/temp -g  -c  -Bdynamic -ldl
-mt  -libr
ary=iostream,rwtools7 -DACE_HAS_EXCEPTIONS  -o
/v/sbansal/out/temp/playground/Ex
ecAgent.o -I/v/sbansal/out/include/playground
-I/exe/tibco/tibrv5/include -I/v/s
bansal/out/include/common -I/v/sbansal/out/include/utils
-I/v/sbansal/out/includ
e/transport -I/usr/ACE_wrappers src/ExecAgent.cc
"/v/sbansal/out/include/playground/Global.h", line 43: Warning: String
literal c
onverted to char* in initialization.
"/opt/SUNWspro/WS6U2/include/CC/rw7/rw/defs.h", line 316: Error: A
typedef name
cannot be used in an elaborated type specifier..
"/opt/SUNWspro/WS6U2/include/CC/rw7/rw/defs.h", line 317: Error: A
typedef name
cannot be used in an elaborated type specifier..
"/opt/SUNWspro/WS6U2/include/CC/rw7/rw/defs.h", line 318: Error: A
typedef name
cannot be used in an elaborated type specifier..
"/opt/SUNWspro/WS6U2/include/CCios/rlocks.h", line 50: Error: A typedef
name can
not be used in an elaborated type specifier..
"/opt/SUNWspro/WS6U2/include/CCios/rlocks.h", line 51: Error: A typedef
name can
not be used in an elaborated type specifier..
"/opt/SUNWspro/WS6U2/include/CCios/iostream.h", line 37: Error: A
typedef name c
annot be used in an elaborated type specifier..
"/opt/SUNWspro/WS6U2/include/CCios/iostream.h", line 38: Error: A
typedef name c
annot be used in an elaborated type specifier..
"/opt/SUNWspro/WS6U2/include/CCios/iostream.h", line 40: Error: A
typedef name c
annot be used in an elaborated type specifier..
"/opt/SUNWspro/WS6U2/include/CCios/iostream.h", line 214: Error: A
typedef name
cannot be used in an elaborated type specifier..
"/opt/SUNWspro/WS6U2/include/CCios/iostream.h", line 214: Error:
Multiple declar
ation for ios.
"/opt/SUNWspro/WS6U2/include/CCios/iostream.h", line 220: Error: The
destructor
name must match the class name.
"/opt/SUNWspro/WS6U2/include/CCios/iostream.h", line 220: Error: Member
function
s in a local class must be defined in the class.
"/opt/SUNWspro/WS6U2/include/CCios/iostream.h", line 278: Error: A local
class c
annot have a static member.
"/opt/SUNWspro/WS6U2/include/CCios/iostream.h", line 281: Error: A local
class c
annot have a static member.
"/opt/SUNWspro/WS6U2/include/CCios/iostream.h", line 282: Error: A local
class c
annot have a static member.
"/opt/SUNWspro/WS6U2/include/CCios/iostream.h", line 290: Error: Could
not find
a match for std::basic_ios<char, std::char_traits<char>>::rdbuf().
"/opt/SUNWspro/WS6U2/include/CCios/iostream.h", line 291: Error: Could
not find
a match for stream_locker::stream_locker(std::basic_ios<char,
std::char_traits<c
har>>*, stream_locker::lock_choice).
"/opt/SUNWspro/WS6U2/include/CCios/iostream.h", line 291: Error: The
function "t
est_safe_flag" must have a prototype.
"/opt/SUNWspro/WS6U2/include/CCios/iostream.h", line 292: Error: Use "."
or "->"
 to call unsafe_ios::rdbuf().
"/opt/SUNWspro/WS6U2/include/CCios/iostream.h", line 294: Error: Could
not find
a match for std::basic_ios<char, std::char_traits<char>>::tie().
"/opt/SUNWspro/WS6U2/include/CCios/iostream.h", line 295: Error: Could
not find
a match for stream_locker::stream_locker(std::basic_ios<char,
std::char_traits<c
har>>*, stream_locker::lock_choice).
"/opt/SUNWspro/WS6U2/include/CCios/iostream.h", line 295: Error: The
function "t
est_safe_flag" must have a prototype.
"/opt/SUNWspro/WS6U2/include/CCios/iostream.h", line 296: Error: Could
not find
a match for unsafe_ios::tie().
"/opt/SUNWspro/WS6U2/include/CCios/iostream.h", line 298: Warning
(Anachronism):
 Old explicit specialization syntax.
"/opt/SUNWspro/WS6U2/include/CCios/iostream.h", line 299: Error: Could
not find
a match for stream_locker::stream_locker(std::basic_ios<char,
std::char_traits<c
har>>*, stream_locker::lock_choice).
"/opt/SUNWspro/WS6U2/include/CCios/iostream.h", line 299: Error: The
function "t
est_safe_flag" must have a prototype.
Compilation aborted, too many Error messages.
make: *** [/v/sbansal/out/temp/playground/ExecAgent.o] Error 1
ron4-prd-bond2:sbansal:/v/sbansal/eurex/commoncore/playground >
 
-----Original Message-----
From: Burnham, Todd (N-Scitor) [mailto:todd.burnham@lmco.com] 
Sent: Wednesday, July 09, 2003 8:50 PM
To: 'Manish Jain'; ace-users@cs.wustl.edu
Subject: RE: [ace-users] compiling issue on Sun 5.8 with ACE 5.3
 
Manish,  
On your compile line do you actually see the -DACE_HAS_EXCEPTIONS
statement? If not copy your compile statement from src/CbotEngine.cc and
add it into the compile to see if it works.
 
Todd Burnham 
SBIRS TT&C Development 
Boulder, CO. - Spine Dr - B/A5-8 
(303) 581-4350 
-----Original Message-----
From: Manish Jain [mailto:mjain@itangel.com]
Sent: Wednesday, July 09, 2003 8:12 AM
To: ace-users@cs.wustl.edu
Subject: FW: [ace-users] compiling issue on Sun 5.8 with ACE 5.3
I am using the below version of C++: but still get the same error: Also
mentioning the changes I have done. Can you please help me in this
regard?
 
Thanks
Manish Jain
 
CC: Sun WorkShop 6 update 2 C++ 5.3 Patch 111685-15 2003/05/14
 
 

 
-----Original Message-----
From: Burnham, Todd (N-Scitor) [mailto:todd.burnham@lmco.com] 
Sent: Wednesday, July 09, 2003 5:40 PM
To: 'Manish Jain'
Subject: RE: [ace-users] compiling issue on Sun 5.8 with ACE 5.3
 
Manish,
 
You need to make sure that your platform_sunos5_sunc++.GNU file is
current with the WS6U2 (5.3) compiler. If you look at the file, probably
in /opt/ACE/SunOS5.8/include/makeinclude/ you will probably find that
the file may only valid for the 5.2 compiler. There are checks for the
major release number and then the minor release number. Make sure you
are setting inline=1 and exceptions=1. These will set the following
compiler switches 
 
-D__ACE_INLINE__ and -DACE_HAS_EXCEPTIONS
 
The error you are getting will go away if the -DACE_HAS_EXCEPTIONS
switch is, well, switched. Without this switch config-sunos5.5.h will
define a switch called _RWSTD_NO_EXCEPTIONS which is why you are getting
the errors in the standard include files.
Todd Burnham 
SBIRS TT&C Development 
Boulder, CO. - Spine Dr - B/A5-8 
(303) 581-4350 
-----Original Message-----
From: Manish Jain [mailto:mjain@itangel.com]
Sent: Wednesday, July 09, 2003 2:24 AM
To: ace-users@cs.wustl.edu
Subject: [ace-users] compiling issue on Sun 5.8 with ACE 5.3
Importance: High
Getting the following error while compiling the code with ACE 5.3 build.
Any idea on below?
 
 
 
/opt/SUNWspro/bin/CC -temp=/export/home/mjain/out/temp -g -c  -Bdynamic
-ldl -mt -library=iostream,rwtools7  -o
/export/home/mjain/out/temp/engine/CbotEngine.o
-I/export/home/mjain/out/include/engine -I/usr/tibco/tibrv//include
-I/export/home/mjain/out/include/utils
-I/export/home/mjain/out/include/common
-I/export/home/mjain/out/include/transport -I/usr/ACE_wrappers
-I/export/home/mjain/out/include/datetime -I/opt/sybase/OCS-12_5/include
src/CbotEngine.cc
"/opt/SUNWspro/WS6U2/include/CC/Cstd/./stdexcept", line 57: Error:
Function std::logic_error::~logic_error() can throw only the exceptions
thrown by the function std::exception::~exception() it overrides.
"/opt/SUNWspro/WS6U2/include/CC/Cstd/./stdexcept", line 60: Error:
Function std::logic_error::what() const can throw only the exceptions
thrown by the function std::exception::what() const it overrides.
"/opt/SUNWspro/WS6U2/include/CC/Cstd/./stdexcept", line 128: Error:
Function std::runtime_error::~runtime_error() can throw only the
exceptions thrown by the function std::exception::~exception() it
overrides.
"/opt/SUNWspro/WS6U2/include/CC/Cstd/./stdexcept", line 131: Error:
Function std::runtime_error::what() const can throw only the exceptions
thrown by the function std::exception::what() const it overrides.
"/opt/SUNWspro/WS6U2/include/CC/Cstd/./istream", line 41: Error: Use ";"
to terminate declarations.
"/opt/SUNWspro/WS6U2/include/CC/Cstd/./ostream", line 444: Error:
Illegal number of arguments for std::basic_ostream<char,
std::char_traits<char>>::operator<<(std::basic_ostream<std::basic_ostrea
m<std::charT, std::traits>::charT, std::basic_ostream<std::charT,
std::traits>::traits>&, std::basic_ostream<char,
std::char_traits<char>>::charT).
"/opt/SUNWspro/WS6U2/include/CC/Cstd/./iostream", line 43:     Where:
While specializing "std::basic_ostream<char, std::char_traits<char>>".
"/opt/SUNWspro/WS6U2/include/CC/Cstd/./iostream", line 43:     Where:
Specialized in non-template code.
"/opt/SUNWspro/WS6U2/include/CC/Cstd/./ostream", line 450: Error:
Illegal number of arguments for std::basic_ostream<char,
std::char_traits<char>>::operator<<(std::basic_ostream<std::basic_ostrea
m<std::charT, std::traits>::charT, std::basic_ostream<std::charT,
std::traits>::traits>&, char).
"/opt/SUNWspro/WS6U2/include/CC/Cstd/./iostream", line 43:     Where:
While specializing "std::basic_ostream<char, std::char_traits<char>>".
"/opt/SUNWspro/WS6U2/include/CC/Cstd/./iostream", line 43:     Where:
Specialized in non-template code.
"/opt/SUNWspro/WS6U2/include/CC/Cstd/./ostream", line 457: Error:
Illegal number of arguments for std::basic_ostream<char,
std::char_traits<char>>::operator<<(std::basic_ostream<char,
std::char_traits<char>>&, char).
"/opt/SUNWspro/WS6U2/include/CC/Cstd/./iostream", line 43:     Where:
While specializing "std::basic_ostream<char, std::char_traits<char>>".
"/opt/SUNWspro/WS6U2/include/CC/Cstd/./iostream", line 43:     Where:
Specialized in non-template code.
"/opt/SUNWspro/WS6U2/include/CC/Cstd/./ostream", line 464: Error:
Illegal number of arguments for std::basic_ostream<char,
std::char_traits<char>>::operator<<(std::basic_ostream<std::basic_ostrea
m<std::charT, std::traits>::charT, std::basic_ostream<std::charT,
std::traits>::traits>&, const std::basic_ostream<char,
std::char_traits<char>>::charT*).
"/opt/SUNWspro/WS6U2/include/CC/Cstd/./iostream", line 43:     Where:
While specializing "std::basic_ostream<char, std::char_traits<char>>".
"/opt/SUNWspro/WS6U2/include/CC/Cstd/./iostream", line 43:     Where:
Specialized in non-template code.
"/opt/SUNWspro/WS6U2/include/CC/Cstd/./ostream", line 470: Error:
Illegal number of arguments for std::basic_ostream<char,
std::char_traits<char>>::operator<<(std::basic_ostream<std::basic_ostrea
m<std::charT, std::traits>::charT, std::basic_ostream<std::charT,
std::traits>::traits>&, const char*).
"/opt/SUNWspro/WS6U2/include/CC/Cstd/./iostream", line 43:     Where:
While specializing "std::basic_ostream<char, std::char_traits<char>>".
"/opt/SUNWspro/WS6U2/include/CC/Cstd/./iostream", line 43:     Where:
Specialized in non-template code.
"/opt/SUNWspro/WS6U2/include/CC/Cstd/./ostream", line 477: Error:
Illegal number of arguments for std::basic_ostream<char,
std::char_traits<char>>::operator<<(std::basic_ostream<char,
std::char_traits<char>>&, const char*).
"/opt/SUNWspro/WS6U2/include/CC/Cstd/./ostream", line 488: Error:
Illegal number of arguments for std::basic_ostream<char,
std::char_traits<char>>::operator<<(std::basic_ostream<char,
std::basic_ostream<std::charT, std::traits>::traits>&, unsigned char).
"/opt/SUNWspro/WS6U2/include/CC/Cstd/./iostream", line 43:     Where:
While specializing "std::basic_ostream<char, std::char_traits<char>>".
"/opt/SUNWspro/WS6U2/include/CC/Cstd/./iostream", line 43:     Where:
Specialized in non-template code.
"/opt/SUNWspro/WS6U2/include/CC/Cstd/./ostream", line 492: Error:
Illegal number of arguments for std::basic_ostream<char,
std::char_traits<char>>::operator<<(std::basic_ostream<char,
std::basic_ostream<std::charT, std::traits>::traits>&, signed char).
"/opt/SUNWspro/WS6U2/include/CC/Cstd/./iostream", line 43:     Where:
While specializing "std::basic_ostream<char, std::char_traits<char>>".
"/opt/SUNWspro/WS6U2/include/CC/Cstd/./iostream", line 43:     Where:
Specialized in non-template code.
"/opt/SUNWspro/WS6U2/include/CC/Cstd/./ostream", line 496: Error:
Illegal number of arguments for std::basic_ostream<char,
std::char_traits<char>>::operator<<(std::basic_ostream<char,
std::basic_ostream<std::charT, std::traits>::traits>&, const unsigned
char*).
"/opt/SUNWspro/WS6U2/include/CC/Cstd/./iostream", line 43:     Where:
While specializing "std::basic_ostream<char, std::char_traits<char>>".
"/opt/SUNWspro/WS6U2/include/CC/Cstd/./iostream", line 43:     Where:
Specialized in non-template code.
"/opt/SUNWspro/WS6U2/include/CC/Cstd/./ostream", line 500: Error:
Illegal number of arguments for std::basic_ostream<char,
std::char_traits<char>>::operator<<(std::basic_ostream<char,
std::basic_ostream<std::charT, std::traits>::traits>&, const signed
char*).
"/opt/SUNWspro/WS6U2/include/CC/Cstd/./iostream", line 43:     Where:
While specializing "std::basic_ostream<char, std::char_traits<char>>".
"/opt/SUNWspro/WS6U2/include/CC/Cstd/./iostream", line 43:     Where:
Specialized in non-template code.
"/opt/SUNWspro/WS6U2/include/CC/Cstd/./ostream", line 510: Error:
Illegal number of arguments for std::basic_ostream<char,
std::char_traits<char>>::operator<<(std::basic_ostream<std::basic_ostrea
m<std::charT, std::traits>::charT, std::basic_ostream<std::charT,
std::traits>::traits>&, const
std::basic_string<std::basic_ostream<std::charT, std::traits>::charT,
std::basic_ostream<std::charT, std::traits>::traits,
std::basic_ostream<std::charT, std::traits>::Allocator>&).
"/opt/SUNWspro/WS6U2/include/CC/Cstd/./iostream", line 43:     Where:
While specializing "std::basic_ostream<char, std::char_traits<char>>".
"/opt/SUNWspro/WS6U2/include/CC/Cstd/./iostream", line 43:     Where:
Specialized in non-template code.
"/opt/SUNWspro/WS6U2/include/CC/Cstd/./ostream", line 592: Error:
storage class extern not allowed for a member.
"/opt/SUNWspro/WS6U2/include/CC/Cstd/./iostream", line 43:     Where:
While specializing "std::basic_ostream<char, std::char_traits<char>>".
"/opt/SUNWspro/WS6U2/include/CC/Cstd/./iostream", line 43:     Where:
Specialized in non-template code.
"/opt/SUNWspro/WS6U2/include/CC/Cstd/./ostream", line 592: Error: The
type "std::basic_ostream<char, std::char_traits<char>>" is incomplete.
"/opt/SUNWspro/WS6U2/include/CC/Cstd/./iostream", line 43:     Where:
While specializing "std::basic_ostream<char, std::char_traits<char>>".
"/opt/SUNWspro/WS6U2/include/CC/Cstd/./iostream", line 43:     Where:
Specialized in non-template code.
"/opt/SUNWspro/WS6U2/include/CC/Cstd/./ostream", line 593: Error:
storage class extern not allowed for a member.
"/opt/SUNWspro/WS6U2/include/CC/Cstd/./iostream", line 43:     Where:
While specializing "std::basic_ostream<char, std::char_traits<char>>".
"/opt/SUNWspro/WS6U2/include/CC/Cstd/./iostream", line 43:     Where:
Specialized in non-template code.
"/opt/SUNWspro/WS6U2/include/CC/Cstd/./ostream", line 593: Error: The
type "std::basic_ostream<char, std::char_traits<char>>" is incomplete.
"/opt/SUNWspro/WS6U2/include/CC/Cstd/./iostream", line 43:     Where:
While specializing "std::basic_ostream<char, std::char_traits<char>>".
"/opt/SUNWspro/WS6U2/include/CC/Cstd/./iostream", line 43:     Where:
Specialized in non-template code.
"/opt/SUNWspro/WS6U2/include/CC/Cstd/./ostream", line 594: Error:
storage class extern not allowed for a member.
"/opt/SUNWspro/WS6U2/include/CC/Cstd/./iostream", line 43:     Where:
While specializing "std::basic_ostream<char, std::char_traits<char>>".
"/opt/SUNWspro/WS6U2/include/CC/Cstd/./iostream", line 43:     Where:
Specialized in non-template code.
"/opt/SUNWspro/WS6U2/include/CC/Cstd/./ostream", line 594: Error: The
type "std::basic_ostream<char, std::char_traits<char>>" is incomplete.
"/opt/SUNWspro/WS6U2/include/CC/Cstd/./iostream", line 43:     Where:
While specializing "std::basic_ostream<char, std::char_traits<char>>".
"/opt/SUNWspro/WS6U2/include/CC/Cstd/./iostream", line 43:     Where:
Specialized in non-template code.
"/opt/SUNWspro/WS6U2/include/CC/Cstd/./ostream", line 444: Error:
Illegal number of arguments for std::basic_ostream<wchar_t,
std::char_traits<wchar_t>>::operator<<(std::basic_ostream<std::basic_ost
ream<std::charT, std::traits>::charT, std::basic_ostream<std::charT,
std::traits>::traits>&, std::basic_ostream<wchar_t,
std::char_traits<wchar_t>>::charT).
"/opt/SUNWspro/WS6U2/include/CC/Cstd/./iostream", line 46:     Where:
While specializing "std::basic_ostream<wchar_t,
std::char_traits<wchar_t>>".
"/opt/SUNWspro/WS6U2/include/CC/Cstd/./iostream", line 46:     Where:
Specialized in non-template code.
"/opt/SUNWspro/WS6U2/include/CC/Cstd/./ostream", line 450: Error:
Illegal number of arguments for std::basic_ostream<wchar_t,
std::char_traits<wchar_t>>::operator<<(std::basic_ostream<std::basic_ost
ream<std::charT, std::traits>::charT, std::basic_ostream<std::charT,
std::traits>::traits>&, char).
"/opt/SUNWspro/WS6U2/include/CC/Cstd/./iostream", line 46:     Where:
While specializing "std::basic_ostream<wchar_t,
std::char_traits<wchar_t>>".
"/opt/SUNWspro/WS6U2/include/CC/Cstd/./iostream", line 46:     Where:
Specialized in non-template code.
"/opt/SUNWspro/WS6U2/include/CC/Cstd/./ostream", line 457: Error:
Illegal number of arguments for std::basic_ostream<wchar_t,
std::char_traits<wchar_t>>::operator<<(std::basic_ostream<char,
std::char_traits<char>>&, char).
"/opt/SUNWspro/WS6U2/include/CC/Cstd/./iostream", line 46:     Where:
While specializing "std::basic_ostream<wchar_t,
std::char_traits<wchar_t>>".
"/opt/SUNWspro/WS6U2/include/CC/Cstd/./iostream", line 46:     Where:
Specialized in non-template code.
Compilation aborted, too many Error messages.
gmake: *** [/export/home/mjain/out/temp/engine/CbotEngine.o] Error 1
mjain@angelsun ~/cvs/eurex/eurexcore/engine%

------=_NextPart_001_00A3_01C34B9F.E5ADED10
Content-Type: text/html;
	charset="us-ascii"
Content-Transfer-Encoding: quoted-printable

<!DOCTYPE HTML PUBLIC "-//W3C//DTD HTML 4.0 Transitional//EN">
<html xmlns:v=3D"urn:schemas-microsoft-com:vml" =
xmlns:o=3D"urn:schemas-microsoft-com:office:office" =
xmlns:w=3D"urn:schemas-microsoft-com:office:word" =
xmlns:st1=3D"urn:schemas-microsoft-com:office:smarttags" =
xmlns=3D"http://www.w3.org/TR/REC-html40">

<head>
<META HTTP-EQUIV=3D"Content-Type" CONTENT=3D"text/html; =
charset=3Dus-ascii">


<meta name=3DProgId content=3DWord.Document>
<meta name=3DGenerator content=3D"Microsoft Word 10">
<meta name=3DOriginator content=3D"Microsoft Word 10">
<link rel=3DFile-List href=3D"cid:filelist.xml@01C34B9F.DE9C3BD0">
<link rel=3DEdit-Time-Data href=3D"cid:editdata.mso@01C34B9F.DE9C3BD0">
<!--[if !mso]>
<style>
v\:* {behavior:url(#default#VML);}
o\:* {behavior:url(#default#VML);}
w\:* {behavior:url(#default#VML);}
..shape {behavior:url(#default#VML);}
</style>
<![endif]--><o:SmartTagType
 namespaceuri=3D"urn:schemas-microsoft-com:office:smarttags" =
name=3D"time"/>
<o:SmartTagType =
namespaceuri=3D"urn:schemas-microsoft-com:office:smarttags"
 name=3D"date"/>
<!--[if gte mso 9]><xml>
 <o:OfficeDocumentSettings>
  <o:DoNotRelyOnCSS/>
 </o:OfficeDocumentSettings>
</xml><![endif]--><!--[if gte mso 9]><xml>
 <w:WordDocument>
  <w:SpellingState>Clean</w:SpellingState>
  <w:GrammarState>Clean</w:GrammarState>
  <w:DocumentKind>DocumentEmail</w:DocumentKind>
  <w:EnvelopeVis/>
  <w:Compatibility>
   <w:BreakWrappedTables/>
   <w:SnapToGridInCell/>
   <w:WrapTextWithPunct/>
   <w:UseAsianBreakRules/>
  </w:Compatibility>
  <w:BrowserLevel>MicrosoftInternetExplorer4</w:BrowserLevel>
 </w:WordDocument>
</xml><![endif]--><!--[if !mso]>
<style>
st1\:*{behavior:url(#default#ieooui) }
</style>
<![endif]-->
<style>
<!--
 /* Font Definitions */
 @font-face
	{font-family:Tahoma;
	panose-1:2 11 6 4 3 5 4 4 2 4;
	mso-font-charset:0;
	mso-generic-font-family:swiss;
	mso-font-pitch:variable;
	mso-font-signature:553679495 -2147483648 8 0 66047 0;}
 /* Style Definitions */
 p.MsoNormal, li.MsoNormal, div.MsoNormal
	{mso-style-parent:"";
	margin:0in;
	margin-bottom:.0001pt;
	mso-pagination:widow-orphan;
	font-size:12.0pt;
	font-family:"Times New Roman";
	mso-fareast-font-family:"Times New Roman";}
a:link, span.MsoHyperlink
	{color:blue;
	text-decoration:underline;
	text-underline:single;}
a:visited, span.MsoHyperlinkFollowed
	{color:purple;
	text-decoration:underline;
	text-underline:single;}
p
	{mso-margin-top-alt:auto;
	margin-right:0in;
	mso-margin-bottom-alt:auto;
	margin-left:0in;
	mso-pagination:widow-orphan;
	font-size:12.0pt;
	font-family:"Times New Roman";
	mso-fareast-font-family:"Times New Roman";}
span.EmailStyle18
	{mso-style-type:personal;
	mso-style-noshow:yes;
	mso-ansi-font-size:10.0pt;
	mso-bidi-font-size:10.0pt;
	font-family:Arial;
	mso-ascii-font-family:Arial;
	mso-hansi-font-family:Arial;
	mso-bidi-font-family:Arial;
	color:windowtext;}
span.EmailStyle19
	{mso-style-type:personal;
	mso-style-noshow:yes;
	mso-ansi-font-size:10.0pt;
	mso-bidi-font-size:10.0pt;
	font-family:Arial;
	mso-ascii-font-family:Arial;
	mso-hansi-font-family:Arial;
	mso-bidi-font-family:Arial;
	color:navy;}
span.EmailStyle20
	{mso-style-type:personal;
	mso-style-noshow:yes;
	mso-ansi-font-size:10.0pt;
	mso-bidi-font-size:10.0pt;
	font-family:Arial;
	mso-ascii-font-family:Arial;
	mso-hansi-font-family:Arial;
	mso-bidi-font-family:Arial;
	color:navy;}
span.EmailStyle21
	{mso-style-type:personal;
	mso-style-noshow:yes;
	mso-ansi-font-size:10.0pt;
	mso-bidi-font-size:10.0pt;
	font-family:Arial;
	mso-ascii-font-family:Arial;
	mso-hansi-font-family:Arial;
	mso-bidi-font-family:Arial;
	color:navy;}
span.EmailStyle22
	{mso-style-type:personal;
	mso-style-noshow:yes;
	mso-ansi-font-size:10.0pt;
	mso-bidi-font-size:10.0pt;
	font-family:Arial;
	mso-ascii-font-family:Arial;
	mso-hansi-font-family:Arial;
	mso-bidi-font-family:Arial;
	color:navy;}
span.EmailStyle23
	{mso-style-type:personal-reply;
	mso-style-noshow:yes;
	mso-ansi-font-size:10.0pt;
	mso-bidi-font-size:10.0pt;
	font-family:Arial;
	mso-ascii-font-family:Arial;
	mso-hansi-font-family:Arial;
	mso-bidi-font-family:Arial;
	color:navy;}
span.GramE
	{mso-style-name:"";
	mso-gram-e:yes;}
@page Section1
	{size:8.5in 11.0in;
	margin:1.0in 1.25in 1.0in 1.25in;
	mso-header-margin:.5in;
	mso-footer-margin:.5in;
	mso-paper-source:0;}
div.Section1
	{page:Section1;}
-->
</style>
<!--[if gte mso 10]>
<style>
 /* Style Definitions */=20
 table.MsoNormalTable
	{mso-style-name:"Table Normal";
	mso-tstyle-rowband-size:0;
	mso-tstyle-colband-size:0;
	mso-style-noshow:yes;
	mso-style-parent:"";
	mso-padding-alt:0in 5.4pt 0in 5.4pt;
	mso-para-margin:0in;
	mso-para-margin-bottom:.0001pt;
	mso-pagination:widow-orphan;
	font-size:10.0pt;
	font-family:"Times New Roman";}
</style>
<![endif]-->
</head>

<body lang=3DEN-US link=3Dblue vlink=3Dpurple =
style=3D'tab-interval:.5in'>

<div class=3DSection1>

<p class=3DMsoNormal style=3D'margin-left:.5in'><font size=3D2 =
face=3DArial><span
style=3D'font-size:10.0pt;font-family:Arial'>Can you please also lookint =
to the
following error as <span =
class=3DGramE>well:</span><o:p></o:p></span></font></p>

<p class=3DMsoNormal style=3D'margin-left:.5in'><font size=3D2 =
color=3Dnavy face=3DArial><span
style=3D'font-size:10.0pt;font-family:Arial;color:navy'><o:p>&nbsp;</o:p>=
</span></font></p>

<p class=3DMsoNormal style=3D'margin-left:.5in'><font size=3D2 =
color=3Dnavy face=3DArial><span
style=3D'font-size:10.0pt;font-family:Arial;color:navy'><o:p>&nbsp;</o:p>=
</span></font></p>

<p class=3DMsoNormal style=3D'margin-left:.5in'><font size=3D2 =
color=3Dnavy face=3DArial><span
style=3D'font-size:10.0pt;font-family:Arial;color:navy'>Compiling
/v/sbansal/out/temp/playground/ExecAgent.o<o:p></o:p></span></font></p>

<p class=3DMsoNormal style=3D'margin-left:.5in'><font size=3D2 =
color=3Dnavy face=3DArial><span
style=3D'font-size:10.0pt;font-family:Arial;color:navy'>/opt/SUNWspro/bin=
/CC
-temp=3D/v/sbansal/out/temp -g<span style=3D'mso-spacerun:yes'>&nbsp;
</span>-c<span style=3D'mso-spacerun:yes'>&nbsp; </span>-Bdynamic -ldl =
-mt<span
style=3D'mso-spacerun:yes'>&nbsp; =
</span>-libr<o:p></o:p></span></font></p>

<p class=3DMsoNormal style=3D'margin-left:.5in'><font size=3D2 =
color=3Dnavy face=3DArial><span
style=3D'font-size:10.0pt;font-family:Arial;color:navy'>ary=3Diostream,rw=
tools7
-DACE_HAS_EXCEPTIONS<span style=3D'mso-spacerun:yes'>&nbsp; </span>-o
/v/sbansal/out/temp/playground/Ex<o:p></o:p></span></font></p>

<p class=3DMsoNormal style=3D'margin-left:.5in'><font size=3D2 =
color=3Dnavy face=3DArial><span
style=3D'font-size:10.0pt;font-family:Arial;color:navy'>ecAgent.o
-I/v/sbansal/out/include/playground -I/exe/tibco/tibrv5/include =
-I/v/s<o:p></o:p></span></font></p>

<p class=3DMsoNormal style=3D'margin-left:.5in'><font size=3D2 =
color=3Dnavy face=3DArial><span
style=3D'font-size:10.0pt;font-family:Arial;color:navy'>bansal/out/includ=
e/common
-I/v/sbansal/out/include/utils =
-I/v/sbansal/out/includ<o:p></o:p></span></font></p>

<p class=3DMsoNormal style=3D'margin-left:.5in'><font size=3D2 =
color=3Dnavy face=3DArial><span
style=3D'font-size:10.0pt;font-family:Arial;color:navy'>e/transport
-I/usr/ACE_wrappers src/ExecAgent.cc<o:p></o:p></span></font></p>

<p class=3DMsoNormal style=3D'margin-left:.5in'><font size=3D2 =
color=3Dnavy face=3DArial><span
style=3D'font-size:10.0pt;font-family:Arial;color:navy'>&quot;/v/sbansal/=
out/include/playground/Global.h&quot;,
line 43: Warning: String literal c<o:p></o:p></span></font></p>

<p class=3DMsoNormal style=3D'margin-left:.5in'><font size=3D2 =
color=3Dnavy face=3DArial><span
style=3D'font-size:10.0pt;font-family:Arial;color:navy'>onverted to =
char* in
initialization.<o:p></o:p></span></font></p>

<p class=3DMsoNormal style=3D'margin-left:.5in'><font size=3D2 =
color=3Dnavy face=3DArial><span
style=3D'font-size:10.0pt;font-family:Arial;color:navy'>&quot;/opt/SUNWsp=
ro/WS6U2/include/CC/rw7/rw/defs.h&quot;,
line 316: Error: A typedef name<o:p></o:p></span></font></p>

<p class=3DMsoNormal style=3D'margin-left:.5in'><font size=3D2 =
color=3Dnavy face=3DArial><span
style=3D'font-size:10.0pt;font-family:Arial;color:navy'>cannot be used =
in an
elaborated type specifier..<o:p></o:p></span></font></p>

<p class=3DMsoNormal style=3D'margin-left:.5in'><font size=3D2 =
color=3Dnavy face=3DArial><span
style=3D'font-size:10.0pt;font-family:Arial;color:navy'>&quot;/opt/SUNWsp=
ro/WS6U2/include/CC/rw7/rw/defs.h&quot;,
line 317: Error: A typedef name<o:p></o:p></span></font></p>

<p class=3DMsoNormal style=3D'margin-left:.5in'><font size=3D2 =
color=3Dnavy face=3DArial><span
style=3D'font-size:10.0pt;font-family:Arial;color:navy'>cannot be used =
in an
elaborated type specifier..<o:p></o:p></span></font></p>

<p class=3DMsoNormal style=3D'margin-left:.5in'><font size=3D2 =
color=3Dnavy face=3DArial><span
style=3D'font-size:10.0pt;font-family:Arial;color:navy'>&quot;/opt/SUNWsp=
ro/WS6U2/include/CC/rw7/rw/defs.h&quot;,
line 318: Error: A typedef name<o:p></o:p></span></font></p>

<p class=3DMsoNormal style=3D'margin-left:.5in'><font size=3D2 =
color=3Dnavy face=3DArial><span
style=3D'font-size:10.0pt;font-family:Arial;color:navy'>cannot be used =
in an
elaborated type specifier..<o:p></o:p></span></font></p>

<p class=3DMsoNormal style=3D'margin-left:.5in'><font size=3D2 =
color=3Dnavy face=3DArial><span
style=3D'font-size:10.0pt;font-family:Arial;color:navy'>&quot;/opt/SUNWsp=
ro/WS6U2/include/CCios/rlocks.h&quot;,
line 50: Error: A typedef name can<o:p></o:p></span></font></p>

<p class=3DMsoNormal style=3D'margin-left:.5in'><font size=3D2 =
color=3Dnavy face=3DArial><span
style=3D'font-size:10.0pt;font-family:Arial;color:navy'>not be used in =
an
elaborated type specifier..<o:p></o:p></span></font></p>

<p class=3DMsoNormal style=3D'margin-left:.5in'><font size=3D2 =
color=3Dnavy face=3DArial><span
style=3D'font-size:10.0pt;font-family:Arial;color:navy'>&quot;/opt/SUNWsp=
ro/WS6U2/include/CCios/rlocks.h&quot;,
line 51: Error: A typedef name can<o:p></o:p></span></font></p>

<p class=3DMsoNormal style=3D'margin-left:.5in'><font size=3D2 =
color=3Dnavy face=3DArial><span
style=3D'font-size:10.0pt;font-family:Arial;color:navy'>not be used in =
an
elaborated type specifier..<o:p></o:p></span></font></p>

<p class=3DMsoNormal style=3D'margin-left:.5in'><font size=3D2 =
color=3Dnavy face=3DArial><span
style=3D'font-size:10.0pt;font-family:Arial;color:navy'>&quot;/opt/SUNWsp=
ro/WS6U2/include/CCios/iostream.h&quot;,
line 37: Error: A typedef name c<o:p></o:p></span></font></p>

<p class=3DMsoNormal style=3D'margin-left:.5in'><font size=3D2 =
color=3Dnavy face=3DArial><span
style=3D'font-size:10.0pt;font-family:Arial;color:navy'>annot be used in =
an
elaborated type specifier..<o:p></o:p></span></font></p>

<p class=3DMsoNormal style=3D'margin-left:.5in'><font size=3D2 =
color=3Dnavy face=3DArial><span
style=3D'font-size:10.0pt;font-family:Arial;color:navy'>&quot;/opt/SUNWsp=
ro/WS6U2/include/CCios/iostream.h&quot;,
line 38: Error: A typedef name c<o:p></o:p></span></font></p>

<p class=3DMsoNormal style=3D'margin-left:.5in'><font size=3D2 =
color=3Dnavy face=3DArial><span
style=3D'font-size:10.0pt;font-family:Arial;color:navy'>annot be used in =
an
elaborated type specifier..<o:p></o:p></span></font></p>

<p class=3DMsoNormal style=3D'margin-left:.5in'><font size=3D2 =
color=3Dnavy face=3DArial><span
style=3D'font-size:10.0pt;font-family:Arial;color:navy'>&quot;/opt/SUNWsp=
ro/WS6U2/include/CCios/iostream.h&quot;,
line 40: Error: A typedef name c<o:p></o:p></span></font></p>

<p class=3DMsoNormal style=3D'margin-left:.5in'><font size=3D2 =
color=3Dnavy face=3DArial><span
style=3D'font-size:10.0pt;font-family:Arial;color:navy'>annot be used in =
an
elaborated type specifier..<o:p></o:p></span></font></p>

<p class=3DMsoNormal style=3D'margin-left:.5in'><font size=3D2 =
color=3Dnavy face=3DArial><span
style=3D'font-size:10.0pt;font-family:Arial;color:navy'>&quot;/opt/SUNWsp=
ro/WS6U2/include/CCios/iostream.h&quot;,
line 214: Error: A typedef name<o:p></o:p></span></font></p>

<p class=3DMsoNormal style=3D'margin-left:.5in'><font size=3D2 =
color=3Dnavy face=3DArial><span
style=3D'font-size:10.0pt;font-family:Arial;color:navy'>cannot be used =
in an
elaborated type specifier..<o:p></o:p></span></font></p>

<p class=3DMsoNormal style=3D'margin-left:.5in'><font size=3D2 =
color=3Dnavy face=3DArial><span
style=3D'font-size:10.0pt;font-family:Arial;color:navy'>&quot;/opt/SUNWsp=
ro/WS6U2/include/CCios/iostream.h&quot;,
line 214: Error: Multiple declar<o:p></o:p></span></font></p>

<p class=3DMsoNormal style=3D'margin-left:.5in'><font size=3D2 =
color=3Dnavy face=3DArial><span
style=3D'font-size:10.0pt;font-family:Arial;color:navy'>ation for =
ios.<o:p></o:p></span></font></p>

<p class=3DMsoNormal style=3D'margin-left:.5in'><font size=3D2 =
color=3Dnavy face=3DArial><span
style=3D'font-size:10.0pt;font-family:Arial;color:navy'>&quot;/opt/SUNWsp=
ro/WS6U2/include/CCios/iostream.h&quot;,
line 220: Error: The destructor<o:p></o:p></span></font></p>

<p class=3DMsoNormal style=3D'margin-left:.5in'><font size=3D2 =
color=3Dnavy face=3DArial><span
style=3D'font-size:10.0pt;font-family:Arial;color:navy'>name must match =
the class
name.<o:p></o:p></span></font></p>

<p class=3DMsoNormal style=3D'margin-left:.5in'><font size=3D2 =
color=3Dnavy face=3DArial><span
style=3D'font-size:10.0pt;font-family:Arial;color:navy'>&quot;/opt/SUNWsp=
ro/WS6U2/include/CCios/iostream.h&quot;,
line 220: Error: Member function<o:p></o:p></span></font></p>

<p class=3DMsoNormal style=3D'margin-left:.5in'><font size=3D2 =
color=3Dnavy face=3DArial><span
style=3D'font-size:10.0pt;font-family:Arial;color:navy'>s in a local =
class must
be defined in the class.<o:p></o:p></span></font></p>

<p class=3DMsoNormal style=3D'margin-left:.5in'><font size=3D2 =
color=3Dnavy face=3DArial><span
style=3D'font-size:10.0pt;font-family:Arial;color:navy'>&quot;/opt/SUNWsp=
ro/WS6U2/include/CCios/iostream.h&quot;,
line 278: Error: A local class c<o:p></o:p></span></font></p>

<p class=3DMsoNormal style=3D'margin-left:.5in'><font size=3D2 =
color=3Dnavy face=3DArial><span
style=3D'font-size:10.0pt;font-family:Arial;color:navy'>annot have a =
static
member.<o:p></o:p></span></font></p>

<p class=3DMsoNormal style=3D'margin-left:.5in'><font size=3D2 =
color=3Dnavy face=3DArial><span
style=3D'font-size:10.0pt;font-family:Arial;color:navy'>&quot;/opt/SUNWsp=
ro/WS6U2/include/CCios/iostream.h&quot;,
line 281: Error: A local class c<o:p></o:p></span></font></p>

<p class=3DMsoNormal style=3D'margin-left:.5in'><font size=3D2 =
color=3Dnavy face=3DArial><span
style=3D'font-size:10.0pt;font-family:Arial;color:navy'>annot have a =
static
member.<o:p></o:p></span></font></p>

<p class=3DMsoNormal style=3D'margin-left:.5in'><font size=3D2 =
color=3Dnavy face=3DArial><span
style=3D'font-size:10.0pt;font-family:Arial;color:navy'>&quot;/opt/SUNWsp=
ro/WS6U2/include/CCios/iostream.h&quot;,
line 282: Error: A local class c<o:p></o:p></span></font></p>

<p class=3DMsoNormal style=3D'margin-left:.5in'><font size=3D2 =
color=3Dnavy face=3DArial><span
style=3D'font-size:10.0pt;font-family:Arial;color:navy'>annot have a =
static
member.<o:p></o:p></span></font></p>

<p class=3DMsoNormal style=3D'margin-left:.5in'><font size=3D2 =
color=3Dnavy face=3DArial><span
style=3D'font-size:10.0pt;font-family:Arial;color:navy'>&quot;/opt/SUNWsp=
ro/WS6U2/include/CCios/iostream.h&quot;,
line 290: Error: Could not find<o:p></o:p></span></font></p>

<p class=3DMsoNormal style=3D'margin-left:.5in'><font size=3D2 =
color=3Dnavy face=3DArial><span
style=3D'font-size:10.0pt;font-family:Arial;color:navy'>a match for =
std::basic_ios&lt;char,
std::char_traits&lt;char&gt;&gt;::rdbuf().<o:p></o:p></span></font></p>

<p class=3DMsoNormal style=3D'margin-left:.5in'><font size=3D2 =
color=3Dnavy face=3DArial><span
style=3D'font-size:10.0pt;font-family:Arial;color:navy'>&quot;/opt/SUNWsp=
ro/WS6U2/include/CCios/iostream.h&quot;,
line 291: Error: Could not find<o:p></o:p></span></font></p>

<p class=3DMsoNormal style=3D'margin-left:.5in'><font size=3D2 =
color=3Dnavy face=3DArial><span
style=3D'font-size:10.0pt;font-family:Arial;color:navy'>a match for
stream_locker::stream_locker(std::basic_ios&lt;char, =
std::char_traits&lt;c<o:p></o:p></span></font></p>

<p class=3DMsoNormal style=3D'margin-left:.5in'><font size=3D2 =
color=3Dnavy face=3DArial><span
style=3D'font-size:10.0pt;font-family:Arial;color:navy'>har&gt;&gt;*,
stream_locker::lock_choice).<o:p></o:p></span></font></p>

<p class=3DMsoNormal style=3D'margin-left:.5in'><font size=3D2 =
color=3Dnavy face=3DArial><span
style=3D'font-size:10.0pt;font-family:Arial;color:navy'>&quot;/opt/SUNWsp=
ro/WS6U2/include/CCios/iostream.h&quot;,
line 291: Error: The function &quot;t<o:p></o:p></span></font></p>

<p class=3DMsoNormal style=3D'margin-left:.5in'><font size=3D2 =
color=3Dnavy face=3DArial><span
style=3D'font-size:10.0pt;font-family:Arial;color:navy'>est_safe_flag&quo=
t; must
have a prototype.<o:p></o:p></span></font></p>

<p class=3DMsoNormal style=3D'margin-left:.5in'><font size=3D2 =
color=3Dnavy face=3DArial><span
style=3D'font-size:10.0pt;font-family:Arial;color:navy'>&quot;/opt/SUNWsp=
ro/WS6U2/include/CCios/iostream.h&quot;,
line 292: Error: Use &quot;.&quot; or =
&quot;-&gt;&quot;<o:p></o:p></span></font></p>

<p class=3DMsoNormal style=3D'margin-left:.5in'><font size=3D2 =
color=3Dnavy face=3DArial><span
style=3D'font-size:10.0pt;font-family:Arial;color:navy'><span
style=3D'mso-spacerun:yes'>&nbsp;</span>to call =
unsafe_ios::rdbuf().<o:p></o:p></span></font></p>

<p class=3DMsoNormal style=3D'margin-left:.5in'><font size=3D2 =
color=3Dnavy face=3DArial><span
style=3D'font-size:10.0pt;font-family:Arial;color:navy'>&quot;/opt/SUNWsp=
ro/WS6U2/include/CCios/iostream.h&quot;,
line 294: Error: Could not find<o:p></o:p></span></font></p>

<p class=3DMsoNormal style=3D'margin-left:.5in'><font size=3D2 =
color=3Dnavy face=3DArial><span
style=3D'font-size:10.0pt;font-family:Arial;color:navy'>a match for
std::basic_ios&lt;char, =
std::char_traits&lt;char&gt;&gt;::tie().<o:p></o:p></span></font></p>

<p class=3DMsoNormal style=3D'margin-left:.5in'><font size=3D2 =
color=3Dnavy face=3DArial><span
style=3D'font-size:10.0pt;font-family:Arial;color:navy'>&quot;/opt/SUNWsp=
ro/WS6U2/include/CCios/iostream.h&quot;,
line 295: Error: Could not find<o:p></o:p></span></font></p>

<p class=3DMsoNormal style=3D'margin-left:.5in'><font size=3D2 =
color=3Dnavy face=3DArial><span
style=3D'font-size:10.0pt;font-family:Arial;color:navy'>a match for
stream_locker::stream_locker(std::basic_ios&lt;char, =
std::char_traits&lt;c<o:p></o:p></span></font></p>

<p class=3DMsoNormal style=3D'margin-left:.5in'><font size=3D2 =
color=3Dnavy face=3DArial><span
style=3D'font-size:10.0pt;font-family:Arial;color:navy'>har&gt;&gt;*,
stream_locker::lock_choice).<o:p></o:p></span></font></p>

<p class=3DMsoNormal style=3D'margin-left:.5in'><font size=3D2 =
color=3Dnavy face=3DArial><span
style=3D'font-size:10.0pt;font-family:Arial;color:navy'>&quot;/opt/SUNWsp=
ro/WS6U2/include/CCios/iostream.h&quot;,
line 295: Error: The function &quot;t<o:p></o:p></span></font></p>

<p class=3DMsoNormal style=3D'margin-left:.5in'><font size=3D2 =
color=3Dnavy face=3DArial><span
style=3D'font-size:10.0pt;font-family:Arial;color:navy'>est_safe_flag&quo=
t; must
have a prototype.<o:p></o:p></span></font></p>

<p class=3DMsoNormal style=3D'margin-left:.5in'><font size=3D2 =
color=3Dnavy face=3DArial><span
style=3D'font-size:10.0pt;font-family:Arial;color:navy'>&quot;/opt/SUNWsp=
ro/WS6U2/include/CCios/iostream.h&quot;,
line 296: Error: Could not find<o:p></o:p></span></font></p>

<p class=3DMsoNormal style=3D'margin-left:.5in'><font size=3D2 =
color=3Dnavy face=3DArial><span
style=3D'font-size:10.0pt;font-family:Arial;color:navy'>a match for
unsafe_ios::tie().<o:p></o:p></span></font></p>

<p class=3DMsoNormal style=3D'margin-left:.5in'><font size=3D2 =
color=3Dnavy face=3DArial><span
style=3D'font-size:10.0pt;font-family:Arial;color:navy'>&quot;/opt/SUNWsp=
ro/WS6U2/include/CCios/iostream.h&quot;,
line 298: Warning (Anachronism):<o:p></o:p></span></font></p>

<p class=3DMsoNormal style=3D'margin-left:.5in'><font size=3D2 =
color=3Dnavy face=3DArial><span
style=3D'font-size:10.0pt;font-family:Arial;color:navy'><span
style=3D'mso-spacerun:yes'>&nbsp;</span>Old explicit specialization =
syntax.<o:p></o:p></span></font></p>

<p class=3DMsoNormal style=3D'margin-left:.5in'><font size=3D2 =
color=3Dnavy face=3DArial><span
style=3D'font-size:10.0pt;font-family:Arial;color:navy'>&quot;/opt/SUNWsp=
ro/WS6U2/include/CCios/iostream.h&quot;,
line 299: Error: Could not find<o:p></o:p></span></font></p>

<p class=3DMsoNormal style=3D'margin-left:.5in'><font size=3D2 =
color=3Dnavy face=3DArial><span
style=3D'font-size:10.0pt;font-family:Arial;color:navy'>a match for
stream_locker::stream_locker(std::basic_ios&lt;char, =
std::char_traits&lt;c<o:p></o:p></span></font></p>

<p class=3DMsoNormal style=3D'margin-left:.5in'><font size=3D2 =
color=3Dnavy face=3DArial><span
style=3D'font-size:10.0pt;font-family:Arial;color:navy'>har&gt;&gt;*,
stream_locker::lock_choice).<o:p></o:p></span></font></p>

<p class=3DMsoNormal style=3D'margin-left:.5in'><font size=3D2 =
color=3Dnavy face=3DArial><span
style=3D'font-size:10.0pt;font-family:Arial;color:navy'>&quot;/opt/SUNWsp=
ro/WS6U2/include/CCios/iostream.h&quot;,
line 299: Error: The function &quot;t<o:p></o:p></span></font></p>

<p class=3DMsoNormal style=3D'margin-left:.5in'><font size=3D2 =
color=3Dnavy face=3DArial><span
style=3D'font-size:10.0pt;font-family:Arial;color:navy'>est_safe_flag&quo=
t; must
have a prototype.<o:p></o:p></span></font></p>

<p class=3DMsoNormal style=3D'margin-left:.5in'><font size=3D2 =
color=3Dnavy face=3DArial><span
style=3D'font-size:10.0pt;font-family:Arial;color:navy'>Compilation =
aborted, too
many Error messages.<o:p></o:p></span></font></p>

<p class=3DMsoNormal style=3D'margin-left:.5in'><font size=3D2 =
color=3Dnavy face=3DArial><span
style=3D'font-size:10.0pt;font-family:Arial;color:navy'>make: ***
[/v/sbansal/out/temp/playground/ExecAgent.o] Error =
1<o:p></o:p></span></font></p>

<p class=3DMsoNormal style=3D'margin-left:.5in'><font size=3D2 =
color=3Dnavy face=3DArial><span
style=3D'font-size:10.0pt;font-family:Arial;color:navy'>ron4-prd-bond2:sb=
ansal:/v/sbansal/eurex/commoncore/playground
&gt;<o:p></o:p></span></font></p>

<p class=3DMsoNormal style=3D'margin-left:.5in'><font size=3D2 =
color=3Dnavy face=3DArial><span
style=3D'font-size:10.0pt;font-family:Arial;color:navy'><o:p>&nbsp;</o:p>=
</span></font></p>

<p class=3DMsoNormal style=3D'margin-left:1.0in'><font size=3D2 =
face=3DTahoma><span
style=3D'font-size:10.0pt;font-family:Tahoma'>-----Original =
Message-----<br>
<b><span style=3D'font-weight:bold'>From:</span></b> Burnham, Todd =
(N-Scitor)
[mailto:todd.burnham@lmco.com] <br>
<b><span style=3D'font-weight:bold'>Sent:</span></b> =
</span></font><st1:date
Month=3D"7" Day=3D"9" Year=3D"2003"><font size=3D2 face=3DTahoma><span =
style=3D'font-size:
 10.0pt;font-family:Tahoma'>Wednesday, July 09, =
2003</span></font></st1:date><font
size=3D2 face=3DTahoma><span =
style=3D'font-size:10.0pt;font-family:Tahoma'> </span></font><st1:time
Hour=3D"20" Minute=3D"50"><font size=3D2 face=3DTahoma><span =
style=3D'font-size:10.0pt;
 font-family:Tahoma'>8:50 PM</span></font></st1:time><font size=3D2 =
face=3DTahoma><span
style=3D'font-size:10.0pt;font-family:Tahoma'><br>
<b><span style=3D'font-weight:bold'>To:</span></b> 'Manish Jain';
ace-users@cs.wustl.edu<br>
<b><span style=3D'font-weight:bold'>Subject:</span></b> RE: [ace-users] =
compiling
issue on Sun 5.8 with ACE 5.3</span></font><o:p></o:p></p>

<p class=3DMsoNormal style=3D'margin-left:1.0in'><font size=3D3 =
face=3D"Times New Roman"><span
style=3D'font-size:12.0pt'><o:p>&nbsp;</o:p></span></font></p>

<div>

<div>

<p class=3DMsoNormal style=3D'margin-left:1.0in'><font size=3D2 =
color=3Dblue
face=3DArial><span =
style=3D'font-size:10.0pt;font-family:Arial;color:blue'>Manish,&nbsp;
</span></font><o:p></o:p></p>

</div>

<div>

<p class=3DMsoNormal style=3D'margin-left:1.0in'><font size=3D2 =
color=3Dblue
face=3DArial><span =
style=3D'font-size:10.0pt;font-family:Arial;color:blue'>On your
compile line do you actually see the -DACE_HAS_EXCEPTIONS statement? If =
not
copy your compile statement from src/CbotEngine.cc and add it into the =
compile
to see if it works.<o:p></o:p></span></font></p>

</div>

</div>

<div>

<p class=3DMsoNormal style=3D'margin-left:1.0in'><font size=3D3 =
face=3D"Times New Roman"><span
style=3D'font-size:12.0pt'>&nbsp;<o:p></o:p></span></font></p>

</div>

<p style=3D'margin-left:1.0in'><font size=3D2 face=3DArial><span =
style=3D'font-size:
10.0pt;font-family:Arial'>Todd Burnham</span></font> <br>
<font size=3D2 face=3DArial><span =
style=3D'font-size:10.0pt;font-family:Arial'>SBIRS
TT&amp;C Development</span></font> <br>
<font size=3D2 face=3DArial><span =
style=3D'font-size:10.0pt;font-family:Arial'>Boulder,
CO. - Spine Dr - B/A5-8</span></font> <br>
<font size=3D2 face=3DArial><span =
style=3D'font-size:10.0pt;font-family:Arial'>(303)
581-4350</span></font> <o:p></o:p></p>

<blockquote =
style=3D'margin-top:5.0pt;margin-right:0in;margin-bottom:5.0pt'>

<p class=3DMsoNormal =
style=3D'mso-margin-top-alt:0in;margin-right:0in;margin-bottom:
12.0pt;margin-left:1.0in'><font size=3D2 face=3DTahoma><span =
style=3D'font-size:10.0pt;
font-family:Tahoma'>-----Original Message-----<br>
<b><span style=3D'font-weight:bold'>From:</span></b> Manish Jain
[mailto:mjain@itangel.com]<br>
<b><span style=3D'font-weight:bold'>Sent:</span></b> =
</span></font><st1:date
Month=3D"7" Day=3D"9" Year=3D"2003"><font size=3D2 face=3DTahoma><span =
style=3D'font-size:
 10.0pt;font-family:Tahoma'>Wednesday, July 09, =
2003</span></font></st1:date><font
size=3D2 face=3DTahoma><span =
style=3D'font-size:10.0pt;font-family:Tahoma'> </span></font><st1:time
Hour=3D"8" Minute=3D"12"><font size=3D2 face=3DTahoma><span =
style=3D'font-size:10.0pt;
 font-family:Tahoma'>8:12 AM</span></font></st1:time><font size=3D2 =
face=3DTahoma><span
style=3D'font-size:10.0pt;font-family:Tahoma'><br>
<b><span style=3D'font-weight:bold'>To:</span></b> =
ace-users@cs.wustl.edu<br>
<b><span style=3D'font-weight:bold'>Subject:</span></b> FW: [ace-users] =
compiling
issue on Sun 5.8 with ACE 5.3</span></font><o:p></o:p></p>

<p class=3DMsoNormal style=3D'margin-left:1.0in'><font size=3D2 =
color=3Dnavy
face=3DArial><span =
style=3D'font-size:10.0pt;font-family:Arial;color:navy'>I am
using the below version of C++: but still get the same error: Also =
mentioning
the changes I have done. Can you please help me in this =
regard?<o:p></o:p></span></font></p>

<p class=3DMsoNormal style=3D'margin-left:1.0in'><font size=3D2 =
color=3Dnavy
face=3DArial><span =
style=3D'font-size:10.0pt;font-family:Arial;color:navy'><o:p>&nbsp;</o:p>=
</span></font></p>

<p class=3DMsoNormal style=3D'margin-left:1.0in'><font size=3D2 =
color=3Dnavy
face=3DArial><span =
style=3D'font-size:10.0pt;font-family:Arial;color:navy'>Thanks<o:p></o:p>=
</span></font></p>

<p class=3DMsoNormal style=3D'margin-left:1.0in'><font size=3D2 =
color=3Dnavy
face=3DArial><span =
style=3D'font-size:10.0pt;font-family:Arial;color:navy'>Manish
Jain<o:p></o:p></span></font></p>

<p class=3DMsoNormal style=3D'margin-left:1.0in'><font size=3D2 =
color=3Dnavy
face=3DArial><span =
style=3D'font-size:10.0pt;font-family:Arial;color:navy'><o:p>&nbsp;</o:p>=
</span></font></p>

<p class=3DMsoNormal style=3D'margin-left:1.0in'><font size=3D2 =
color=3Dnavy
face=3DArial><span =
style=3D'font-size:10.0pt;font-family:Arial;color:navy'>CC: Sun
WorkShop 6 update 2 C++ 5.3 Patch 111685-15 =
2003/05/14<o:p></o:p></span></font></p>

<p class=3DMsoNormal style=3D'margin-left:1.0in'><font size=3D2 =
color=3Dnavy
face=3DArial><span =
style=3D'font-size:10.0pt;font-family:Arial;color:navy'><o:p>&nbsp;</o:p>=
</span></font></p>

<p class=3DMsoNormal style=3D'margin-left:1.0in'><font size=3D2 =
color=3Dnavy
face=3DArial><span =
style=3D'font-size:10.0pt;font-family:Arial;color:navy'><o:p>&nbsp;</o:p>=
</span></font></p>

<p class=3DMsoNormal style=3D'margin-left:1.0in'><font size=3D2 =
color=3Dnavy
face=3DArial><span =
style=3D'font-size:10.0pt;font-family:Arial;color:navy'><img
width=3D484 height=3D316 id=3D"_x0000_i1025" =
src=3D"cid:image001.jpg@01C34B9F.DE9C3BD0"><o:p></o:p></span></font></p>

<p class=3DMsoNormal style=3D'margin-left:1.0in'><font size=3D2 =
color=3Dnavy
face=3DArial><span =
style=3D'font-size:10.0pt;font-family:Arial;color:navy'><o:p>&nbsp;</o:p>=
</span></font></p>

<p class=3DMsoNormal style=3D'margin-left:1.5in'><font size=3D2 =
face=3DTahoma><span
style=3D'font-size:10.0pt;font-family:Tahoma'>-----Original =
Message-----<br>
<b><span style=3D'font-weight:bold'>From:</span></b> Burnham, Todd =
(N-Scitor)
[mailto:todd.burnham@lmco.com] <br>
<b><span style=3D'font-weight:bold'>Sent:</span></b> =
</span></font><st1:date
Month=3D"7" Day=3D"9" Year=3D"2003"><font size=3D2 face=3DTahoma><span =
style=3D'font-size:
 10.0pt;font-family:Tahoma'>Wednesday, July 09, =
2003</span></font></st1:date><font
size=3D2 face=3DTahoma><span =
style=3D'font-size:10.0pt;font-family:Tahoma'> </span></font><st1:time
Hour=3D"17" Minute=3D"40"><font size=3D2 face=3DTahoma><span =
style=3D'font-size:10.0pt;
 font-family:Tahoma'>5:40 PM</span></font></st1:time><font size=3D2 =
face=3DTahoma><span
style=3D'font-size:10.0pt;font-family:Tahoma'><br>
<b><span style=3D'font-weight:bold'>To:</span></b> 'Manish Jain'<br>
<b><span style=3D'font-weight:bold'>Subject:</span></b> RE: [ace-users] =
compiling
issue on Sun 5.8 with ACE 5.3</span></font><o:p></o:p></p>

<p class=3DMsoNormal style=3D'margin-left:1.5in'><font size=3D3 =
face=3D"Times New Roman"><span
style=3D'font-size:12.0pt'><o:p>&nbsp;</o:p></span></font></p>

<div>

<p class=3DMsoNormal style=3D'margin-left:1.5in'><font size=3D2 =
color=3Dblue
face=3DArial><span =
style=3D'font-size:10.0pt;font-family:Arial;color:blue'>Manish,</span></f=
ont><o:p></o:p></p>

</div>

<div>

<p class=3DMsoNormal style=3D'margin-left:1.5in'><font size=3D3 =
face=3D"Times New Roman"><span
style=3D'font-size:12.0pt'>&nbsp;<o:p></o:p></span></font></p>

</div>

<div>

<p class=3DMsoNormal style=3D'margin-left:1.5in'><font size=3D2 =
color=3Dblue
face=3DArial><span =
style=3D'font-size:10.0pt;font-family:Arial;color:blue'>You need
to make sure that your platform_sunos5_sunc++.GNU file is current with =
the
WS6U2 (5.3) compiler. If you look at the file, probably in =
/opt/ACE/SunOS5.8/include/makeinclude/
you will probably find that the file may only valid for the 5.2 =
compiler. There
are checks for the major release number and then the minor release =
number. Make
sure you are setting inline=3D1 and exceptions=3D1. These will set the =
following
compiler switches </span></font><o:p></o:p></p>

</div>

<div>

<p class=3DMsoNormal style=3D'margin-left:1.5in'><font size=3D3 =
face=3D"Times New Roman"><span
style=3D'font-size:12.0pt'>&nbsp;<o:p></o:p></span></font></p>

</div>

<div>

<p class=3DMsoNormal style=3D'margin-left:1.5in'><font size=3D2 =
color=3Dblue
face=3DArial><span =
style=3D'font-size:10.0pt;font-family:Arial;color:blue'>-D__ACE_INLINE__
and -DACE_HAS_EXCEPTIONS</span></font><o:p></o:p></p>

</div>

<div>

<p class=3DMsoNormal style=3D'margin-left:1.5in'><font size=3D3 =
face=3D"Times New Roman"><span
style=3D'font-size:12.0pt'>&nbsp;<o:p></o:p></span></font></p>

</div>

<div>

<p class=3DMsoNormal style=3D'margin-left:1.5in'><font size=3D2 =
color=3Dblue
face=3DArial><span =
style=3D'font-size:10.0pt;font-family:Arial;color:blue'>The
error you are getting will go away if the -DACE_HAS_EXCEPTIONS switch =
is, well,
switched. Without this switch config-sunos5.5.h will define a switch =
called
_RWSTD_NO_EXCEPTIONS which is why you are getting the errors in the =
standard
include files.</span></font><o:p></o:p></p>

</div>

<p style=3D'margin-left:1.5in'><font size=3D2 face=3DArial><span =
style=3D'font-size:
10.0pt;font-family:Arial'>Todd Burnham</span></font> <br>
<font size=3D2 face=3DArial><span =
style=3D'font-size:10.0pt;font-family:Arial'>SBIRS
TT&amp;C Development</span></font> <br>
<font size=3D2 face=3DArial><span =
style=3D'font-size:10.0pt;font-family:Arial'>Boulder,
CO. - Spine Dr - B/A5-8</span></font> <br>
<font size=3D2 face=3DArial><span =
style=3D'font-size:10.0pt;font-family:Arial'>(303)
581-4350</span></font> <o:p></o:p></p>

<blockquote =
style=3D'margin-top:5.0pt;margin-right:0in;margin-bottom:5.0pt'>

<p class=3DMsoNormal =
style=3D'mso-margin-top-alt:0in;margin-right:0in;margin-bottom:
12.0pt;margin-left:1.5in'><font size=3D2 face=3DTahoma><span =
style=3D'font-size:10.0pt;
font-family:Tahoma'>-----Original Message-----<br>
<b><span style=3D'font-weight:bold'>From:</span></b> Manish Jain
[mailto:mjain@itangel.com]<br>
<b><span style=3D'font-weight:bold'>Sent:</span></b> =
</span></font><st1:date
Month=3D"7" Day=3D"9" Year=3D"2003"><font size=3D2 face=3DTahoma><span =
style=3D'font-size:
 10.0pt;font-family:Tahoma'>Wednesday, July 09, =
2003</span></font></st1:date><font
size=3D2 face=3DTahoma><span =
style=3D'font-size:10.0pt;font-family:Tahoma'> </span></font><st1:time
Hour=3D"2" Minute=3D"24"><font size=3D2 face=3DTahoma><span =
style=3D'font-size:10.0pt;
 font-family:Tahoma'>2:24 AM</span></font></st1:time><font size=3D2 =
face=3DTahoma><span
style=3D'font-size:10.0pt;font-family:Tahoma'><br>
<b><span style=3D'font-weight:bold'>To:</span></b> =
ace-users@cs.wustl.edu<br>
<b><span style=3D'font-weight:bold'>Subject:</span></b> [ace-users] =
compiling
issue on Sun 5.8 with ACE 5.3<br>
<b><span style=3D'font-weight:bold'>Importance:</span></b> =
High</span></font><o:p></o:p></p>

<p class=3DMsoNormal style=3D'margin-left:1.5in'><font size=3D3 =
color=3Dnavy
face=3D"Times New Roman"><span =
style=3D'font-size:12.0pt;color:navy'>Getting the
following error while compiling the code with ACE 5.3 build. Any idea on =
below?</span></font><o:p></o:p></p>

<p class=3DMsoNormal style=3D'margin-left:1.5in'><font size=3D2 =
color=3Dnavy
face=3DArial><span =
style=3D'font-size:10.0pt;font-family:Arial;color:navy'><o:p>&nbsp;</o:p>=
</span></font></p>

<p class=3DMsoNormal style=3D'margin-left:1.5in'><font size=3D3 =
color=3Dnavy
face=3D"Times New Roman"><span =
style=3D'font-size:12.0pt;color:navy'><o:p>&nbsp;</o:p></span></font></p>=


<p class=3DMsoNormal style=3D'margin-left:1.5in'><font size=3D2 =
color=3Dnavy
face=3DArial><span =
style=3D'font-size:10.0pt;font-family:Arial;color:navy'><o:p>&nbsp;</o:p>=
</span></font></p>

<p class=3DMsoNormal style=3D'margin-left:1.5in'><a =
name=3D"OLE_LINK2"><font size=3D2
face=3DArial><span =
style=3D'font-size:10.0pt;font-family:Arial'>/opt/SUNWspro/bin/CC
-temp=3D/export/home/mjain/out/temp -g -c<span =
style=3D'mso-spacerun:yes'>&nbsp;
</span>-Bdynamic -ldl -mt -library=3Diostream,rwtools7<span
style=3D'mso-spacerun:yes'>&nbsp; </span>-o
/export/home/mjain/out/temp/engine/CbotEngine.o
-I/export/home/mjain/out/include/engine -I/usr/tibco/tibrv//include
-I/export/home/mjain/out/include/utils =
-I/export/home/mjain/out/include/common
-I/export/home/mjain/out/include/transport -I/usr/ACE_wrappers
-I/export/home/mjain/out/include/datetime -I/opt/sybase/OCS-12_5/include
src/CbotEngine.cc<o:p></o:p></span></font></a></p>

<p class=3DMsoNormal style=3D'margin-left:1.5in'><span =
style=3D'mso-bookmark:OLE_LINK2'><font
size=3D2 face=3DArial><span =
style=3D'font-size:10.0pt;font-family:Arial'>&quot;/opt/SUNWspro/WS6U2/in=
clude/CC/Cstd/./stdexcept&quot;,
line 57: Error: Function std::logic_error::~logic_error() can throw only =
the
exceptions thrown by the function std::exception::~exception() it =
overrides.<o:p></o:p></span></font></span></p>

<p class=3DMsoNormal style=3D'margin-left:1.5in'><span =
style=3D'mso-bookmark:OLE_LINK2'><font
size=3D2 face=3DArial><span =
style=3D'font-size:10.0pt;font-family:Arial'>&quot;/opt/SUNWspro/WS6U2/in=
clude/CC/Cstd/./stdexcept&quot;,
line 60: Error: Function std::logic_error::what() const can throw only =
the
exceptions thrown by the function std::exception::what() const it =
overrides.<o:p></o:p></span></font></span></p>

<p class=3DMsoNormal style=3D'margin-left:1.5in'><span =
style=3D'mso-bookmark:OLE_LINK2'><font
size=3D2 face=3DArial><span =
style=3D'font-size:10.0pt;font-family:Arial'>&quot;/opt/SUNWspro/WS6U2/in=
clude/CC/Cstd/./stdexcept&quot;,
line 128: Error: Function std::runtime_error::~runtime_error() can throw =
only the
exceptions thrown by the function std::exception::~exception() it =
overrides.<o:p></o:p></span></font></span></p>

<p class=3DMsoNormal style=3D'margin-left:1.5in'><span =
style=3D'mso-bookmark:OLE_LINK2'><font
size=3D2 face=3DArial><span =
style=3D'font-size:10.0pt;font-family:Arial'>&quot;/opt/SUNWspro/WS6U2/in=
clude/CC/Cstd/./stdexcept&quot;,
line 131: Error: Function std::runtime_error::what() const can throw =
only the
exceptions thrown by the function std::exception::what() const it =
overrides.<o:p></o:p></span></font></span></p>

<p class=3DMsoNormal style=3D'margin-left:1.5in'><span =
style=3D'mso-bookmark:OLE_LINK2'><font
size=3D2 face=3DArial><span =
style=3D'font-size:10.0pt;font-family:Arial'>&quot;/opt/SUNWspro/WS6U2/in=
clude/CC/Cstd/./istream&quot;,
line 41: Error: Use &quot;;&quot; to terminate =
declarations.<o:p></o:p></span></font></span></p>

<p class=3DMsoNormal style=3D'margin-left:1.5in'><span =
style=3D'mso-bookmark:OLE_LINK2'><font
size=3D2 face=3DArial><span =
style=3D'font-size:10.0pt;font-family:Arial'>&quot;/opt/SUNWspro/WS6U2/in=
clude/CC/Cstd/./ostream&quot;,
line 444: Error: Illegal number of arguments for =
std::basic_ostream&lt;char, =
std::char_traits&lt;char&gt;&gt;::operator&lt;&lt;(std::basic_ostream&lt;=
std::basic_ostream&lt;std::charT,
std::traits&gt;::charT, std::basic_ostream&lt;std::charT,
std::traits&gt;::traits&gt;&amp;, std::basic_ostream&lt;char,
std::char_traits&lt;char&gt;&gt;::charT).<o:p></o:p></span></font></span>=
</p>

<p class=3DMsoNormal style=3D'margin-left:1.5in'><span =
style=3D'mso-bookmark:OLE_LINK2'><font
size=3D2 face=3DArial><span =
style=3D'font-size:10.0pt;font-family:Arial'>&quot;/opt/SUNWspro/WS6U2/in=
clude/CC/Cstd/./iostream&quot;,
line 43:<span style=3D'mso-spacerun:yes'>&nbsp;&nbsp;&nbsp;&nbsp; =
</span>Where:
While specializing &quot;std::basic_ostream&lt;char,
std::char_traits&lt;char&gt;&gt;&quot;.<o:p></o:p></span></font></span></=
p>

<p class=3DMsoNormal style=3D'margin-left:1.5in'><span =
style=3D'mso-bookmark:OLE_LINK2'><font
size=3D2 face=3DArial><span =
style=3D'font-size:10.0pt;font-family:Arial'>&quot;/opt/SUNWspro/WS6U2/in=
clude/CC/Cstd/./iostream&quot;,
line 43:<span style=3D'mso-spacerun:yes'>&nbsp;&nbsp;&nbsp;&nbsp; =
</span>Where:
Specialized in non-template code.<o:p></o:p></span></font></span></p>

<p class=3DMsoNormal style=3D'margin-left:1.5in'><span =
style=3D'mso-bookmark:OLE_LINK2'><font
size=3D2 face=3DArial><span =
style=3D'font-size:10.0pt;font-family:Arial'>&quot;/opt/SUNWspro/WS6U2/in=
clude/CC/Cstd/./ostream&quot;,
line 450: Error: Illegal number of arguments for =
std::basic_ostream&lt;char,
std::char_traits&lt;char&gt;&gt;::operator&lt;&lt;(std::basic_ostream&lt;=
std::basic_ostream&lt;std::charT,
std::traits&gt;::charT, std::basic_ostream&lt;std::charT, =
std::traits&gt;::traits&gt;&amp;,
char).<o:p></o:p></span></font></span></p>

<p class=3DMsoNormal style=3D'margin-left:1.5in'><span =
style=3D'mso-bookmark:OLE_LINK2'><font
size=3D2 face=3DArial><span =
style=3D'font-size:10.0pt;font-family:Arial'>&quot;/opt/SUNWspro/WS6U2/in=
clude/CC/Cstd/./iostream&quot;,
line 43:<span style=3D'mso-spacerun:yes'>&nbsp;&nbsp;&nbsp;&nbsp; =
</span>Where:
While specializing &quot;std::basic_ostream&lt;char,
std::char_traits&lt;char&gt;&gt;&quot;.<o:p></o:p></span></font></span></=
p>

<p class=3DMsoNormal style=3D'margin-left:1.5in'><span =
style=3D'mso-bookmark:OLE_LINK2'><font
size=3D2 face=3DArial><span =
style=3D'font-size:10.0pt;font-family:Arial'>&quot;/opt/SUNWspro/WS6U2/in=
clude/CC/Cstd/./iostream&quot;,
line 43:<span style=3D'mso-spacerun:yes'>&nbsp;&nbsp;&nbsp;&nbsp; =
</span>Where:
Specialized in non-template code.<o:p></o:p></span></font></span></p>

<p class=3DMsoNormal style=3D'margin-left:1.5in'><span =
style=3D'mso-bookmark:OLE_LINK2'><font
size=3D2 face=3DArial><span =
style=3D'font-size:10.0pt;font-family:Arial'>&quot;/opt/SUNWspro/WS6U2/in=
clude/CC/Cstd/./ostream&quot;,
line 457: Error: Illegal number of arguments for =
std::basic_ostream&lt;char,
std::char_traits&lt;char&gt;&gt;::operator&lt;&lt;(std::basic_ostream&lt;=
char,
std::char_traits&lt;char&gt;&gt;&amp;, =
char).<o:p></o:p></span></font></span></p>

<p class=3DMsoNormal style=3D'margin-left:1.5in'><span =
style=3D'mso-bookmark:OLE_LINK2'><font
size=3D2 face=3DArial><span =
style=3D'font-size:10.0pt;font-family:Arial'>&quot;/opt/SUNWspro/WS6U2/in=
clude/CC/Cstd/./iostream&quot;,
line 43:<span style=3D'mso-spacerun:yes'>&nbsp;&nbsp;&nbsp;&nbsp; =
</span>Where:
While specializing &quot;std::basic_ostream&lt;char,
std::char_traits&lt;char&gt;&gt;&quot;.<o:p></o:p></span></font></span></=
p>

<p class=3DMsoNormal style=3D'margin-left:1.5in'><span =
style=3D'mso-bookmark:OLE_LINK2'><font
size=3D2 face=3DArial><span =
style=3D'font-size:10.0pt;font-family:Arial'>&quot;/opt/SUNWspro/WS6U2/in=
clude/CC/Cstd/./iostream&quot;,
line 43:<span style=3D'mso-spacerun:yes'>&nbsp;&nbsp;&nbsp;&nbsp; =
</span>Where:
Specialized in non-template code.<o:p></o:p></span></font></span></p>

<p class=3DMsoNormal style=3D'margin-left:1.5in'><span =
style=3D'mso-bookmark:OLE_LINK2'><font
size=3D2 face=3DArial><span =
style=3D'font-size:10.0pt;font-family:Arial'>&quot;/opt/SUNWspro/WS6U2/in=
clude/CC/Cstd/./ostream&quot;,
line 464: Error: Illegal number of arguments for =
std::basic_ostream&lt;char,
std::char_traits&lt;char&gt;&gt;::operator&lt;&lt;(std::basic_ostream&lt;=
std::basic_ostream&lt;std::charT,
std::traits&gt;::charT, std::basic_ostream&lt;std::charT,
std::traits&gt;::traits&gt;&amp;, const std::basic_ostream&lt;char,
std::char_traits&lt;char&gt;&gt;::charT*).<o:p></o:p></span></font></span=
></p>

<p class=3DMsoNormal style=3D'margin-left:1.5in'><span =
style=3D'mso-bookmark:OLE_LINK2'><font
size=3D2 face=3DArial><span =
style=3D'font-size:10.0pt;font-family:Arial'>&quot;/opt/SUNWspro/WS6U2/in=
clude/CC/Cstd/./iostream&quot;,
line 43:<span style=3D'mso-spacerun:yes'>&nbsp;&nbsp;&nbsp;&nbsp; =
</span>Where:
While specializing &quot;std::basic_ostream&lt;char,
std::char_traits&lt;char&gt;&gt;&quot;.<o:p></o:p></span></font></span></=
p>

<p class=3DMsoNormal style=3D'margin-left:1.5in'><span =
style=3D'mso-bookmark:OLE_LINK2'><font
size=3D2 face=3DArial><span =
style=3D'font-size:10.0pt;font-family:Arial'>&quot;/opt/SUNWspro/WS6U2/in=
clude/CC/Cstd/./iostream&quot;,
line 43:<span style=3D'mso-spacerun:yes'>&nbsp;&nbsp;&nbsp;&nbsp; =
</span>Where:
Specialized in non-template code.<o:p></o:p></span></font></span></p>

<p class=3DMsoNormal style=3D'margin-left:1.5in'><span =
style=3D'mso-bookmark:OLE_LINK2'><font
size=3D2 face=3DArial><span =
style=3D'font-size:10.0pt;font-family:Arial'>&quot;/opt/SUNWspro/WS6U2/in=
clude/CC/Cstd/./ostream&quot;,
line 470: Error: Illegal number of arguments for =
std::basic_ostream&lt;char,
std::char_traits&lt;char&gt;&gt;::operator&lt;&lt;(std::basic_ostream&lt;=
std::basic_ostream&lt;std::charT,
std::traits&gt;::charT, std::basic_ostream&lt;std::charT,
std::traits&gt;::traits&gt;&amp;, const =
char*).<o:p></o:p></span></font></span></p>

<p class=3DMsoNormal style=3D'margin-left:1.5in'><span =
style=3D'mso-bookmark:OLE_LINK2'><font
size=3D2 face=3DArial><span =
style=3D'font-size:10.0pt;font-family:Arial'>&quot;/opt/SUNWspro/WS6U2/in=
clude/CC/Cstd/./iostream&quot;,
line 43:<span style=3D'mso-spacerun:yes'>&nbsp;&nbsp;&nbsp;&nbsp; =
</span>Where:
While specializing &quot;std::basic_ostream&lt;char,
std::char_traits&lt;char&gt;&gt;&quot;.<o:p></o:p></span></font></span></=
p>

<p class=3DMsoNormal style=3D'margin-left:1.5in'><span =
style=3D'mso-bookmark:OLE_LINK2'><font
size=3D2 face=3DArial><span =
style=3D'font-size:10.0pt;font-family:Arial'>&quot;/opt/SUNWspro/WS6U2/in=
clude/CC/Cstd/./iostream&quot;,
line 43:<span style=3D'mso-spacerun:yes'>&nbsp;&nbsp;&nbsp;&nbsp; =
</span>Where:
Specialized in non-template code.<o:p></o:p></span></font></span></p>

<p class=3DMsoNormal style=3D'margin-left:1.5in'><span =
style=3D'mso-bookmark:OLE_LINK2'><font
size=3D2 face=3DArial><span =
style=3D'font-size:10.0pt;font-family:Arial'>&quot;/opt/SUNWspro/WS6U2/in=
clude/CC/Cstd/./ostream&quot;,
line 477: Error: Illegal number of arguments for =
std::basic_ostream&lt;char,
std::char_traits&lt;char&gt;&gt;::operator&lt;&lt;(std::basic_ostream&lt;=
char,
std::char_traits&lt;char&gt;&gt;&amp;, const =
char*).<o:p></o:p></span></font></span></p>

<p class=3DMsoNormal style=3D'margin-left:1.5in'><span =
style=3D'mso-bookmark:OLE_LINK2'><font
size=3D2 face=3DArial><span =
style=3D'font-size:10.0pt;font-family:Arial'>&quot;/opt/SUNWspro/WS6U2/in=
clude/CC/Cstd/./ostream&quot;,
line 488: Error: Illegal number of arguments for =
std::basic_ostream&lt;char,
std::char_traits&lt;char&gt;&gt;::operator&lt;&lt;(std::basic_ostream&lt;=
char,
std::basic_ostream&lt;std::charT, std::traits&gt;::traits&gt;&amp;, =
unsigned
char).<o:p></o:p></span></font></span></p>

<p class=3DMsoNormal style=3D'margin-left:1.5in'><span =
style=3D'mso-bookmark:OLE_LINK2'><font
size=3D2 face=3DArial><span =
style=3D'font-size:10.0pt;font-family:Arial'>&quot;/opt/SUNWspro/WS6U2/in=
clude/CC/Cstd/./iostream&quot;,
line 43:<span style=3D'mso-spacerun:yes'>&nbsp;&nbsp;&nbsp;&nbsp; =
</span>Where:
While specializing &quot;std::basic_ostream&lt;char,
std::char_traits&lt;char&gt;&gt;&quot;.<o:p></o:p></span></font></span></=
p>

<p class=3DMsoNormal style=3D'margin-left:1.5in'><span =
style=3D'mso-bookmark:OLE_LINK2'><font
size=3D2 face=3DArial><span =
style=3D'font-size:10.0pt;font-family:Arial'>&quot;/opt/SUNWspro/WS6U2/in=
clude/CC/Cstd/./iostream&quot;,
line 43:<span style=3D'mso-spacerun:yes'>&nbsp;&nbsp;&nbsp;&nbsp; =
</span>Where:
Specialized in non-template code.<o:p></o:p></span></font></span></p>

<p class=3DMsoNormal style=3D'margin-left:1.5in'><span =
style=3D'mso-bookmark:OLE_LINK2'><font
size=3D2 face=3DArial><span =
style=3D'font-size:10.0pt;font-family:Arial'>&quot;/opt/SUNWspro/WS6U2/in=
clude/CC/Cstd/./ostream&quot;,
line 492: Error: Illegal number of arguments for =
std::basic_ostream&lt;char,
std::char_traits&lt;char&gt;&gt;::operator&lt;&lt;(std::basic_ostream&lt;=
char,
std::basic_ostream&lt;std::charT, std::traits&gt;::traits&gt;&amp;, =
signed
char).<o:p></o:p></span></font></span></p>

<p class=3DMsoNormal style=3D'margin-left:1.5in'><span =
style=3D'mso-bookmark:OLE_LINK2'><font
size=3D2 face=3DArial><span =
style=3D'font-size:10.0pt;font-family:Arial'>&quot;/opt/SUNWspro/WS6U2/in=
clude/CC/Cstd/./iostream&quot;,
line 43:<span style=3D'mso-spacerun:yes'>&nbsp;&nbsp;&nbsp;&nbsp; =
</span>Where:
While specializing &quot;std::basic_ostream&lt;char,
std::char_traits&lt;char&gt;&gt;&quot;.<o:p></o:p></span></font></span></=
p>

<p class=3DMsoNormal style=3D'margin-left:1.5in'><span =
style=3D'mso-bookmark:OLE_LINK2'><font
size=3D2 face=3DArial><span =
style=3D'font-size:10.0pt;font-family:Arial'>&quot;/opt/SUNWspro/WS6U2/in=
clude/CC/Cstd/./iostream&quot;,
line 43:<span style=3D'mso-spacerun:yes'>&nbsp;&nbsp;&nbsp;&nbsp; =
</span>Where:
Specialized in non-template code.<o:p></o:p></span></font></span></p>

<p class=3DMsoNormal style=3D'margin-left:1.5in'><span =
style=3D'mso-bookmark:OLE_LINK2'><font
size=3D2 face=3DArial><span =
style=3D'font-size:10.0pt;font-family:Arial'>&quot;/opt/SUNWspro/WS6U2/in=
clude/CC/Cstd/./ostream&quot;,
line 496: Error: Illegal number of arguments for =
std::basic_ostream&lt;char,
std::char_traits&lt;char&gt;&gt;::operator&lt;&lt;(std::basic_ostream&lt;=
char,
std::basic_ostream&lt;std::charT, std::traits&gt;::traits&gt;&amp;, =
const
unsigned char*).<o:p></o:p></span></font></span></p>

<p class=3DMsoNormal style=3D'margin-left:1.5in'><span =
style=3D'mso-bookmark:OLE_LINK2'><font
size=3D2 face=3DArial><span =
style=3D'font-size:10.0pt;font-family:Arial'>&quot;/opt/SUNWspro/WS6U2/in=
clude/CC/Cstd/./iostream&quot;,
line 43:<span style=3D'mso-spacerun:yes'>&nbsp;&nbsp;&nbsp;&nbsp; =
</span>Where:
While specializing &quot;std::basic_ostream&lt;char,
std::char_traits&lt;char&gt;&gt;&quot;.<o:p></o:p></span></font></span></=
p>

<p class=3DMsoNormal style=3D'margin-left:1.5in'><span =
style=3D'mso-bookmark:OLE_LINK2'><font
size=3D2 face=3DArial><span =
style=3D'font-size:10.0pt;font-family:Arial'>&quot;/opt/SUNWspro/WS6U2/in=
clude/CC/Cstd/./iostream&quot;,
line 43:<span style=3D'mso-spacerun:yes'>&nbsp;&nbsp;&nbsp;&nbsp; =
</span>Where:
Specialized in non-template code.<o:p></o:p></span></font></span></p>

<p class=3DMsoNormal style=3D'margin-left:1.5in'><span =
style=3D'mso-bookmark:OLE_LINK2'><font
size=3D2 face=3DArial><span =
style=3D'font-size:10.0pt;font-family:Arial'>&quot;/opt/SUNWspro/WS6U2/in=
clude/CC/Cstd/./ostream&quot;,
line 500: Error: Illegal number of arguments for =
std::basic_ostream&lt;char,
std::char_traits&lt;char&gt;&gt;::operator&lt;&lt;(std::basic_ostream&lt;=
char,
std::basic_ostream&lt;std::charT, std::traits&gt;::traits&gt;&amp;, =
const
signed char*).<o:p></o:p></span></font></span></p>

<p class=3DMsoNormal style=3D'margin-left:1.5in'><span =
style=3D'mso-bookmark:OLE_LINK2'><font
size=3D2 face=3DArial><span =
style=3D'font-size:10.0pt;font-family:Arial'>&quot;/opt/SUNWspro/WS6U2/in=
clude/CC/Cstd/./iostream&quot;,
line 43:<span style=3D'mso-spacerun:yes'>&nbsp;&nbsp;&nbsp;&nbsp; =
</span>Where:
While specializing &quot;std::basic_ostream&lt;char,
std::char_traits&lt;char&gt;&gt;&quot;.<o:p></o:p></span></font></span></=
p>

<p class=3DMsoNormal style=3D'margin-left:1.5in'><span =
style=3D'mso-bookmark:OLE_LINK2'><font
size=3D2 face=3DArial><span =
style=3D'font-size:10.0pt;font-family:Arial'>&quot;/opt/SUNWspro/WS6U2/in=
clude/CC/Cstd/./iostream&quot;,
line 43:<span style=3D'mso-spacerun:yes'>&nbsp;&nbsp;&nbsp;&nbsp; =
</span>Where:
Specialized in non-template code.<o:p></o:p></span></font></span></p>

<p class=3DMsoNormal style=3D'margin-left:1.5in'><span =
style=3D'mso-bookmark:OLE_LINK2'><font
size=3D2 face=3DArial><span =
style=3D'font-size:10.0pt;font-family:Arial'>&quot;/opt/SUNWspro/WS6U2/in=
clude/CC/Cstd/./ostream&quot;,
line 510: Error: Illegal number of arguments for =
std::basic_ostream&lt;char,
std::char_traits&lt;char&gt;&gt;::operator&lt;&lt;(std::basic_ostream&lt;=
std::basic_ostream&lt;std::charT,
std::traits&gt;::charT, std::basic_ostream&lt;std::charT, =
std::traits&gt;::traits&gt;&amp;,
const std::basic_string&lt;std::basic_ostream&lt;std::charT,
std::traits&gt;::charT, std::basic_ostream&lt;std::charT,
std::traits&gt;::traits, std::basic_ostream&lt;std::charT,
std::traits&gt;::Allocator&gt;&amp;).<o:p></o:p></span></font></span></p>=


<p class=3DMsoNormal style=3D'margin-left:1.5in'><span =
style=3D'mso-bookmark:OLE_LINK2'><font
size=3D2 face=3DArial><span =
style=3D'font-size:10.0pt;font-family:Arial'>&quot;/opt/SUNWspro/WS6U2/in=
clude/CC/Cstd/./iostream&quot;,
line 43:<span style=3D'mso-spacerun:yes'>&nbsp;&nbsp;&nbsp;&nbsp; =
</span>Where:
While specializing &quot;std::basic_ostream&lt;char,
std::char_traits&lt;char&gt;&gt;&quot;.<o:p></o:p></span></font></span></=
p>

<p class=3DMsoNormal style=3D'margin-left:1.5in'><span =
style=3D'mso-bookmark:OLE_LINK2'><font
size=3D2 face=3DArial><span =
style=3D'font-size:10.0pt;font-family:Arial'>&quot;/opt/SUNWspro/WS6U2/in=
clude/CC/Cstd/./iostream&quot;,
line 43:<span style=3D'mso-spacerun:yes'>&nbsp;&nbsp;&nbsp;&nbsp; =
</span>Where:
Specialized in non-template code.<o:p></o:p></span></font></span></p>

<p class=3DMsoNormal style=3D'margin-left:1.5in'><span =
style=3D'mso-bookmark:OLE_LINK2'><font
size=3D2 face=3DArial><span =
style=3D'font-size:10.0pt;font-family:Arial'>&quot;/opt/SUNWspro/WS6U2/in=
clude/CC/Cstd/./ostream&quot;,
line 592: Error: storage class extern not allowed for a =
member.<o:p></o:p></span></font></span></p>

<p class=3DMsoNormal style=3D'margin-left:1.5in'><span =
style=3D'mso-bookmark:OLE_LINK2'><font
size=3D2 face=3DArial><span =
style=3D'font-size:10.0pt;font-family:Arial'>&quot;/opt/SUNWspro/WS6U2/in=
clude/CC/Cstd/./iostream&quot;,
line 43:<span style=3D'mso-spacerun:yes'>&nbsp;&nbsp;&nbsp;&nbsp; =
</span>Where:
While specializing &quot;std::basic_ostream&lt;char,
std::char_traits&lt;char&gt;&gt;&quot;.<o:p></o:p></span></font></span></=
p>

<p class=3DMsoNormal style=3D'margin-left:1.5in'><span =
style=3D'mso-bookmark:OLE_LINK2'><font
size=3D2 face=3DArial><span =
style=3D'font-size:10.0pt;font-family:Arial'>&quot;/opt/SUNWspro/WS6U2/in=
clude/CC/Cstd/./iostream&quot;,
line 43:<span style=3D'mso-spacerun:yes'>&nbsp;&nbsp;&nbsp;&nbsp; =
</span>Where:
Specialized in non-template code.<o:p></o:p></span></font></span></p>

<p class=3DMsoNormal style=3D'margin-left:1.5in'><span =
style=3D'mso-bookmark:OLE_LINK2'><font
size=3D2 face=3DArial><span =
style=3D'font-size:10.0pt;font-family:Arial'>&quot;/opt/SUNWspro/WS6U2/in=
clude/CC/Cstd/./ostream&quot;,
line 592: Error: The type &quot;std::basic_ostream&lt;char,
std::char_traits&lt;char&gt;&gt;&quot; is =
incomplete.<o:p></o:p></span></font></span></p>

<p class=3DMsoNormal style=3D'margin-left:1.5in'><span =
style=3D'mso-bookmark:OLE_LINK2'><font
size=3D2 face=3DArial><span =
style=3D'font-size:10.0pt;font-family:Arial'>&quot;/opt/SUNWspro/WS6U2/in=
clude/CC/Cstd/./iostream&quot;,
line 43:<span style=3D'mso-spacerun:yes'>&nbsp;&nbsp;&nbsp;&nbsp; =
</span>Where:
While specializing &quot;std::basic_ostream&lt;char,
std::char_traits&lt;char&gt;&gt;&quot;.<o:p></o:p></span></font></span></=
p>

<p class=3DMsoNormal style=3D'margin-left:1.5in'><span =
style=3D'mso-bookmark:OLE_LINK2'><font
size=3D2 face=3DArial><span =
style=3D'font-size:10.0pt;font-family:Arial'>&quot;/opt/SUNWspro/WS6U2/in=
clude/CC/Cstd/./iostream&quot;,
line 43:<span style=3D'mso-spacerun:yes'>&nbsp;&nbsp;&nbsp;&nbsp; =
</span>Where:
Specialized in non-template code.<o:p></o:p></span></font></span></p>

<p class=3DMsoNormal style=3D'margin-left:1.5in'><span =
style=3D'mso-bookmark:OLE_LINK2'><font
size=3D2 face=3DArial><span =
style=3D'font-size:10.0pt;font-family:Arial'>&quot;/opt/SUNWspro/WS6U2/in=
clude/CC/Cstd/./ostream&quot;,
line 593: Error: storage class extern not allowed for a =
member.<o:p></o:p></span></font></span></p>

<p class=3DMsoNormal style=3D'margin-left:1.5in'><span =
style=3D'mso-bookmark:OLE_LINK2'><font
size=3D2 face=3DArial><span =
style=3D'font-size:10.0pt;font-family:Arial'>&quot;/opt/SUNWspro/WS6U2/in=
clude/CC/Cstd/./iostream&quot;,
line 43:<span style=3D'mso-spacerun:yes'>&nbsp;&nbsp;&nbsp;&nbsp; =
</span>Where:
While specializing &quot;std::basic_ostream&lt;char,
std::char_traits&lt;char&gt;&gt;&quot;.<o:p></o:p></span></font></span></=
p>

<p class=3DMsoNormal style=3D'margin-left:1.5in'><span =
style=3D'mso-bookmark:OLE_LINK2'><font
size=3D2 face=3DArial><span =
style=3D'font-size:10.0pt;font-family:Arial'>&quot;/opt/SUNWspro/WS6U2/in=
clude/CC/Cstd/./iostream&quot;,
line 43:<span style=3D'mso-spacerun:yes'>&nbsp;&nbsp;&nbsp;&nbsp; =
</span>Where:
Specialized in non-template code.<o:p></o:p></span></font></span></p>

<p class=3DMsoNormal style=3D'margin-left:1.5in'><span =
style=3D'mso-bookmark:OLE_LINK2'><font
size=3D2 face=3DArial><span =
style=3D'font-size:10.0pt;font-family:Arial'>&quot;/opt/SUNWspro/WS6U2/in=
clude/CC/Cstd/./ostream&quot;,
line 593: Error: The type &quot;std::basic_ostream&lt;char,
std::char_traits&lt;char&gt;&gt;&quot; is =
incomplete.<o:p></o:p></span></font></span></p>

<p class=3DMsoNormal style=3D'margin-left:1.5in'><span =
style=3D'mso-bookmark:OLE_LINK2'><font
size=3D2 face=3DArial><span =
style=3D'font-size:10.0pt;font-family:Arial'>&quot;/opt/SUNWspro/WS6U2/in=
clude/CC/Cstd/./iostream&quot;,
line 43:<span style=3D'mso-spacerun:yes'>&nbsp;&nbsp;&nbsp;&nbsp; =
</span>Where:
While specializing &quot;std::basic_ostream&lt;char,
std::char_traits&lt;char&gt;&gt;&quot;.<o:p></o:p></span></font></span></=
p>

<p class=3DMsoNormal style=3D'margin-left:1.5in'><span =
style=3D'mso-bookmark:OLE_LINK2'><font
size=3D2 face=3DArial><span =
style=3D'font-size:10.0pt;font-family:Arial'>&quot;/opt/SUNWspro/WS6U2/in=
clude/CC/Cstd/./iostream&quot;,
line 43:<span style=3D'mso-spacerun:yes'>&nbsp;&nbsp;&nbsp;&nbsp; =
</span>Where:
Specialized in non-template code.<o:p></o:p></span></font></span></p>

<p class=3DMsoNormal style=3D'margin-left:1.5in'><span =
style=3D'mso-bookmark:OLE_LINK2'><font
size=3D2 face=3DArial><span =
style=3D'font-size:10.0pt;font-family:Arial'>&quot;/opt/SUNWspro/WS6U2/in=
clude/CC/Cstd/./ostream&quot;,
line 594: Error: storage class extern not allowed for a =
member.<o:p></o:p></span></font></span></p>

<p class=3DMsoNormal style=3D'margin-left:1.5in'><span =
style=3D'mso-bookmark:OLE_LINK2'><font
size=3D2 face=3DArial><span =
style=3D'font-size:10.0pt;font-family:Arial'>&quot;/opt/SUNWspro/WS6U2/in=
clude/CC/Cstd/./iostream&quot;,
line 43:<span style=3D'mso-spacerun:yes'>&nbsp;&nbsp;&nbsp;&nbsp; =
</span>Where:
While specializing &quot;std::basic_ostream&lt;char,
std::char_traits&lt;char&gt;&gt;&quot;.<o:p></o:p></span></font></span></=
p>

<p class=3DMsoNormal style=3D'margin-left:1.5in'><span =
style=3D'mso-bookmark:OLE_LINK2'><font
size=3D2 face=3DArial><span =
style=3D'font-size:10.0pt;font-family:Arial'>&quot;/opt/SUNWspro/WS6U2/in=
clude/CC/Cstd/./iostream&quot;,
line 43:<span style=3D'mso-spacerun:yes'>&nbsp;&nbsp;&nbsp;&nbsp; =
</span>Where:
Specialized in non-template code.<o:p></o:p></span></font></span></p>

<p class=3DMsoNormal style=3D'margin-left:1.5in'><span =
style=3D'mso-bookmark:OLE_LINK2'><font
size=3D2 face=3DArial><span =
style=3D'font-size:10.0pt;font-family:Arial'>&quot;/opt/SUNWspro/WS6U2/in=
clude/CC/Cstd/./ostream&quot;,
line 594: Error: The type &quot;std::basic_ostream&lt;char,
std::char_traits&lt;char&gt;&gt;&quot; is =
incomplete.<o:p></o:p></span></font></span></p>

<p class=3DMsoNormal style=3D'margin-left:1.5in'><span =
style=3D'mso-bookmark:OLE_LINK2'><font
size=3D2 face=3DArial><span =
style=3D'font-size:10.0pt;font-family:Arial'>&quot;/opt/SUNWspro/WS6U2/in=
clude/CC/Cstd/./iostream&quot;,
line 43:<span style=3D'mso-spacerun:yes'>&nbsp;&nbsp;&nbsp;&nbsp; =
</span>Where:
While specializing &quot;std::basic_ostream&lt;char, =
std::char_traits&lt;char&gt;&gt;&quot;.<o:p></o:p></span></font></span></=
p>

<p class=3DMsoNormal style=3D'margin-left:1.5in'><span =
style=3D'mso-bookmark:OLE_LINK2'><font
size=3D2 face=3DArial><span =
style=3D'font-size:10.0pt;font-family:Arial'>&quot;/opt/SUNWspro/WS6U2/in=
clude/CC/Cstd/./iostream&quot;,
line 43:<span style=3D'mso-spacerun:yes'>&nbsp;&nbsp;&nbsp;&nbsp; =
</span>Where:
Specialized in non-template code.<o:p></o:p></span></font></span></p>

<p class=3DMsoNormal style=3D'margin-left:1.5in'><span =
style=3D'mso-bookmark:OLE_LINK2'><font
size=3D2 face=3DArial><span =
style=3D'font-size:10.0pt;font-family:Arial'>&quot;/opt/SUNWspro/WS6U2/in=
clude/CC/Cstd/./ostream&quot;,
line 444: Error: Illegal number of arguments for =
std::basic_ostream&lt;wchar_t,
std::char_traits&lt;wchar_t&gt;&gt;::operator&lt;&lt;(std::basic_ostream&=
lt;std::basic_ostream&lt;std::charT,
std::traits&gt;::charT, std::basic_ostream&lt;std::charT,
std::traits&gt;::traits&gt;&amp;, std::basic_ostream&lt;wchar_t,
std::char_traits&lt;wchar_t&gt;&gt;::charT).<o:p></o:p></span></font></sp=
an></p>

<p class=3DMsoNormal style=3D'margin-left:1.5in'><span =
style=3D'mso-bookmark:OLE_LINK2'><font
size=3D2 face=3DArial><span =
style=3D'font-size:10.0pt;font-family:Arial'>&quot;/opt/SUNWspro/WS6U2/in=
clude/CC/Cstd/./iostream&quot;,
line 46:<span style=3D'mso-spacerun:yes'>&nbsp;&nbsp;&nbsp;&nbsp; =
</span>Where:
While specializing &quot;std::basic_ostream&lt;wchar_t,
std::char_traits&lt;wchar_t&gt;&gt;&quot;.<o:p></o:p></span></font></span=
></p>

<p class=3DMsoNormal style=3D'margin-left:1.5in'><span =
style=3D'mso-bookmark:OLE_LINK2'><font
size=3D2 face=3DArial><span =
style=3D'font-size:10.0pt;font-family:Arial'>&quot;/opt/SUNWspro/WS6U2/in=
clude/CC/Cstd/./iostream&quot;,
line 46:<span style=3D'mso-spacerun:yes'>&nbsp;&nbsp;&nbsp;&nbsp; =
</span>Where:
Specialized in non-template code.<o:p></o:p></span></font></span></p>

<p class=3DMsoNormal style=3D'margin-left:1.5in'><span =
style=3D'mso-bookmark:OLE_LINK2'><font
size=3D2 face=3DArial><span =
style=3D'font-size:10.0pt;font-family:Arial'>&quot;/opt/SUNWspro/WS6U2/in=
clude/CC/Cstd/./ostream&quot;,
line 450: Error: Illegal number of arguments for =
std::basic_ostream&lt;wchar_t,
std::char_traits&lt;wchar_t&gt;&gt;::operator&lt;&lt;(std::basic_ostream&=
lt;std::basic_ostream&lt;std::charT,
std::traits&gt;::charT, std::basic_ostream&lt;std::charT,
std::traits&gt;::traits&gt;&amp;, =
char).<o:p></o:p></span></font></span></p>

<p class=3DMsoNormal style=3D'margin-left:1.5in'><span =
style=3D'mso-bookmark:OLE_LINK2'><font
size=3D2 face=3DArial><span =
style=3D'font-size:10.0pt;font-family:Arial'>&quot;/opt/SUNWspro/WS6U2/in=
clude/CC/Cstd/./iostream&quot;,
line 46:<span style=3D'mso-spacerun:yes'>&nbsp;&nbsp;&nbsp;&nbsp; =
</span>Where:
While specializing &quot;std::basic_ostream&lt;wchar_t,
std::char_traits&lt;wchar_t&gt;&gt;&quot;.<o:p></o:p></span></font></span=
></p>

<p class=3DMsoNormal style=3D'margin-left:1.5in'><span =
style=3D'mso-bookmark:OLE_LINK2'><font
size=3D2 face=3DArial><span =
style=3D'font-size:10.0pt;font-family:Arial'>&quot;/opt/SUNWspro/WS6U2/in=
clude/CC/Cstd/./iostream&quot;,
line 46:<span style=3D'mso-spacerun:yes'>&nbsp;&nbsp;&nbsp;&nbsp; =
</span>Where:
Specialized in non-template code.<o:p></o:p></span></font></span></p>

<p class=3DMsoNormal style=3D'margin-left:1.5in'><span =
style=3D'mso-bookmark:OLE_LINK2'><font
size=3D2 face=3DArial><span =
style=3D'font-size:10.0pt;font-family:Arial'>&quot;/opt/SUNWspro/WS6U2/in=
clude/CC/Cstd/./ostream&quot;,
line 457: Error: Illegal number of arguments for =
std::basic_ostream&lt;wchar_t,
std::char_traits&lt;wchar_t&gt;&gt;::operator&lt;&lt;(std::basic_ostream&=
lt;char,
std::char_traits&lt;char&gt;&gt;&amp;, =
char).<o:p></o:p></span></font></span></p>

<p class=3DMsoNormal style=3D'margin-left:1.5in'><span =
style=3D'mso-bookmark:OLE_LINK2'><font
size=3D2 face=3DArial><span =
style=3D'font-size:10.0pt;font-family:Arial'>&quot;/opt/SUNWspro/WS6U2/in=
clude/CC/Cstd/./iostream&quot;,
line 46:<span style=3D'mso-spacerun:yes'>&nbsp;&nbsp;&nbsp;&nbsp; =
</span>Where:
While specializing &quot;std::basic_ostream&lt;wchar_t,
std::char_traits&lt;wchar_t&gt;&gt;&quot;.<o:p></o:p></span></font></span=
></p>

<p class=3DMsoNormal style=3D'margin-left:1.5in'><span =
style=3D'mso-bookmark:OLE_LINK2'><font
size=3D2 face=3DArial><span =
style=3D'font-size:10.0pt;font-family:Arial'>&quot;/opt/SUNWspro/WS6U2/in=
clude/CC/Cstd/./iostream&quot;,
line 46:<span style=3D'mso-spacerun:yes'>&nbsp;&nbsp;&nbsp;&nbsp; =
</span>Where:
Specialized in non-template code.<o:p></o:p></span></font></span></p>

<p class=3DMsoNormal style=3D'margin-left:1.5in'><span =
style=3D'mso-bookmark:OLE_LINK2'><font
size=3D2 face=3DArial><span =
style=3D'font-size:10.0pt;font-family:Arial'>Compilation
aborted, too many Error messages.<o:p></o:p></span></font></span></p>

<p class=3DMsoNormal style=3D'margin-left:1.5in'><span =
style=3D'mso-bookmark:OLE_LINK2'><font
size=3D2 face=3DArial><span =
style=3D'font-size:10.0pt;font-family:Arial'>gmake: ***
[/export/home/mjain/out/temp/engine/CbotEngine.o] Error =
1<o:p></o:p></span></font></span></p>

<p class=3DMsoNormal style=3D'margin-left:1.5in'><span =
style=3D'mso-bookmark:OLE_LINK2'><font
size=3D2 face=3DArial><span =
style=3D'font-size:10.0pt;font-family:Arial'>mjain@angelsun
~/cvs/eurex/eurexcore/engine%</span></font></span><font size=3D2 =
face=3DArial><span
style=3D'font-size:10.0pt;font-family:Arial'><o:p></o:p></span></font></p=
>

</blockquote>

</blockquote>

</div>

</body>

</html>

------=_NextPart_001_00A3_01C34B9F.E5ADED10--

------=_NextPart_000_00A2_01C34B9F.E5ADED10
Content-Type: image/jpeg;
	name="image001.jpg"
Content-Transfer-Encoding: base64
Content-ID: <image001.jpg@01C34B9F.DE9C3BD0>

/9j/4AAQSkZJRgABAQEAYABgAAD//gAcU29mdHdhcmU6IE1pY3Jvc29mdCBPZmZpY2X/2wBDAAoH
BwgHBgoICAgLCgoLDhgQDg0NDh0VFhEYIx8lJCIfIiEmKzcvJik0KSEiMEExNDk7Pj4+JS5ESUM8
SDc9Pjv/wAALCAE8AeQBAREA/8QAGwABAAIDAQEAAAAAAAAAAAAAAAQFAgMGBwj/xABBEAACAQQB
AwIBCQYFBQACAgMBAgMABAUREgYTISIxFAcVFyMyQVFVpDdUYYOz0jNCcZPTFiRSgZElckNiNDWC
/90ABAAo/9oACAEBAAA/APZaUpSlKUpSlKUpSlKUpSlKUpSlKUpSlKUpX//Q9lpSlKUpSlKUpSlK
UpSlKUpSlKUpSlKUpSlf/9H2WlKUpSlKUpSlKUpSlKUpSlKUpSlKUpSlKV//0vZaUql6wyV1h+kM
rkLEf9zb2ztGeJbgdfa0FbevfyNePJA2Rw2V696ig6WjvYoe1cPfZCIv2ZjxWNJSg01uB6Tr31vt
erX1nbs5+ss2Ou8djFte3aXHwncj7U3juRTs3kwA+4X3I/wvPH63t7+huq8xnc9kbTIQ8YYomdPq
5F4EXMya20Kf5Qq+Tv6v25dwJeZeM3/UeOxks9zHayWlzO629w8DM6PAqnmhDaAkfxvR3sjwNLPL
5F8lc4+PHPdQY6eO2nvJLhFeQtFG/MIFAJHPbD0gDyvIniK/GdctkbWa6OKmt7drb4i0llSdUk2V
CIxMQHNi6gCLu79Wt+nlp/6szGQfGDHY+GKY5J7S7huZZIVYi2aZQC8PMLoq2yina6AKtyqwn6sk
j6kfFQ4q5uIoZ47eeeOKViruqsCOMZj4gSKSWkUgBvSdDlN6rvb3G9J5a+x/AXVvaSSxs50FIUnl
7HZA8gEaJAB1vYhZfqW+xCWVvLiklyF0sshigeeaJEQqCeUcLOT6090A9/PgcosXXXPKLay4maCN
5YUBkfjKvNbffOPXpZXu4RrkfAkOwVCtKw2euM7BaQ5CwSzXLY83dubW8d2EekDBm4IUb61NcSfv
8jQ3Fs+oLmw6I6fuFT4++urGB2SRpmkcdtS7/VxyOfJXZK62w2dkA78Nn8lmOoSYLeEYibG2l3H3
JtSxiXunfEIQWJUKRz0AoIJJIGfTXVknUM4//FXNvbTQfEW87RShSmxoOXjVQxDAgIzg6b1aALTc
pl720ytnjbDHJdz3cE0waS47SRiNoweR4sdHufcCd68aJZa89XzHOjHJhLxkSWKG4btyM8TyKje6
I0XFRIvImUEaYgHS8tFt1pdNj7G5vMVDE+Uto57FIbsyBubxRgSExrw9VxH5UP45fgA2+56qvba3
lD4qFbi1ufh7t2uXNtD9WkgYyLEWC8ZFJZkVRxfbDS8rAZK5bqOxs5Ld4IrjHy3HFpVLK6vECrqF
PkCQaKuR5bwfSarMV1Bl0wN1fZS0tnkGQktLcRXJPJzdNCqt9WvFVJQcgGJUFtb8HNeqMlLlBh4c
NC+RXuiYfGagjKLA++ZTkVK3C+Qmww1rXrG6TqtIY5jPadiRMlbY9IZZlDu0ywsfbY5KJWJAJ32y
d68iV1Xe3uN6Ty19j+Aure0kljZzoKQpPL2OyB5AI0SADrexrnyuViks7FMbZtk7mKWZojesIUSN
kU6k7RYt9YnjgB9rz4G7DGX8WVxVpkYFdYruBJ0VwAwVlDAHW/OjXODroC8lhaw5QjUsNzG0oie3
E0cbzF3iVeKrKJNoXXiG2wGiZr9R3U+UlxuNx8M8yyyiOSe5McUiRLF3GDKjHkJJuHHRG0fZBGqz
sc62SyuKMMTpZZHFvexFnHLfKLw6cTogSDRD68sCDoGoeLzOQy3UeKuXgS2x97i7i5t0S5Z2kUvb
lWkTiArBW+4trkw3+Ntk8ndW99bY/H2kNzd3EUkwFxOYYwiFA3qCOeW5E0Na1vyNAGE/U063TE4z
t2kFzBaXLSTgTRzTCPiAigqyjvRgnmP82gdDlU2nyhy3dlC64hFurhYDFEbo8OUjW40z8NgBbuE7
CnyHGvSC1ncdQXosm52iQ3NtlLayu1iueSqJGiIKM0frGpUBBVT5fRBAJk3BdOt7ALNMEmxtzzi7
rdslJIOJ4b48hzYb1vR1v2qmtvlAmubT4xOn7x4Zuy1sQsidxZJY4wC0kaIHIlBAVnU8W9QGif/T
9bsJr2aBvj7NLWdW4lY5u6jDQIKtpSR515VTsHwRompuurYLW+ubJoN3EN9DbInI/WK5tg0m9aHE
3S+Pv1/rqvl69MVzLCuLe5DMhs3gZwtzG08UXINJGiE/XIw4synztgNE2EudzMV9a435ihN7cRTS
b+O+oURmL1c+HIqe7r7Gwy61xPMZ2OdbJZXFGGJ0ssji3vYizjlvlF4dOJ0QJBoh9eWBB0DVfbdb
Ty4+xurjD/Dtk7aOayj+JDcizxR6kIX0LznjII5ErslVYcDe4nJS34uorm3S3urKfsTpHKZE5FEk
BViqkjjIvuo87HnWzYUpSlKUpSlKUpSlRclJbRY6c3sDz2zLwliS3acureCOCglh58jR8b34qjOf
6WvLG2Hwc1xb3fdmgiGHnfuAgdyQJ298WE+i2tN3CNnZqw+cMJM5yDondgngtzJLbMssckgHbU7X
kDq51/DuMDr1VFx3UPTUii6sx8P8V2+LvYyQG4EkulK8kBde5NskbAMuyRy2ZXUEeH7ENxlp3tgj
FI5oriSBxsbYc4yG46Xkw3xATk3hdjRBf4PC5ZsPbW1zBc3TK/bhsZzEeKRxgqwQoFVRGpIIVfG9
HdQ8NB0vlkZcfa3zxTQBonngu44o49qy9hpAFjGwjARkfYUj7A1nfWfTmGjXH3EeReS8la7Uwm7u
bjkipGziROUiaUou9jw2vYkVhFJ0pLloks4LmVomhVVsre4az5cEaJm7Y7JIQxkMfsgJ5HEamR9T
4DKY6Rnkd7WWDlwubOVBcxtpfQrqO6CXVdKG2XUf5huvf/pX4GLj849zuv8A4Pxnx29Ly7nH6/jr
tb5+Ndr7uFSkg6V+cbWwgtUaW9VL22aCCQxFI+1xZZFHBVHZg9IIB0mweQ3X9NydLYrBy420imge
2to7e+uUxk9nJM4VVG24BjK3cBVQS5LjW91mZek4sdj8fGMoot1kS3jt0vfioUXhyRuA7qL64jxb
QIMZA0FqbDF0qILae3KPBjWtrKJo3kZCSIzbqdHUoHdjZWbkFLcgQdmrOwwWOxk7TWkLq3HggeZ3
WFNg8I1YkRr4X0oAPSvj0jX/1PXns4Hvor1o93EMTxI+z4VypYa9vJRf/n+tUd5J08OqI4LiC+OQ
kZZBGlvdGCVl4ASMFHacruP1nfEhNkcRrdh+kMRicBHiksrbfYijuJ4YRC87xgakJXyGDeoHewfI
O/Nbz0xijAsQjuUZWZu+l5Ms7EgA8pg3NgQqDRYjSJ/4rrX8HhYupbKJI5ob+2sW+FjjMqQrACqs
Ao1EdEpse40h14XWy5wWEiS8u7mFI45FZ5ZHmZVhGw7OnnUR5KHLJxJZQxOwDW6ywWOsJ0uLeF++
iyL3pJnkdg5TlyZiSx+rjG2JICgDQ8VCyHTjZDMpeST23aDQs27QfEARyLIsazAjUZdFYqVY+W0R
scbDMXdhY4e6ucovKxSI/EAwtKOB8NtVBJXR8+Na3vxuucml6TitLZSMosks7ojwpe/FmTiGZJGU
d0EoqNxc+VRSAQo11Nl8L8DB8D2fhO0vY7Gu3w16eOvHHWta8aqBb9L4e2neVLV3DwPb9mWeSSFI
nK8o1jZiiqeKjioA0APbxWcvTuMltYLftTRC35duSC5lil9R2+5EYO3I6Ztk8mAJ2RusxgscmRtL
+OF4pbKA29usUzpFHGfdRGCE14H3f5V/8RrCx6dxmOvheWsUyyLE0MatcyvHEjFSVRGYqi+hfCgA
BQB4rdkMTZ5Ttm5EyvFvhLb3EkEgB1sc42DcToEjeiVB14FaR05iVuorhLTt9rhxhjkdISUACExA
hGZQq6JUkcF0fSNQr7ovDXWPt7OK0hhSDsoAU5h4keFijAn1clt4022yAB/oZtz05ibnFxYz4T4e
zhlEscNnI9sqsG5AjtlfZvV/ro+4BrdLibObMQZZxN8XbxNFGwuJAgVvtAoG4neh7j/Kv/iNRoul
8PEdrauQrI0avPIyw8HWRVjBbUa8kQ8V0p4KCNACraq+XA4ufIjIS2aNchlfns6LLrRI3on0odke
8cZ9404xU6Rwsdwk4tpiY+PaRrqVo4QsiSAIhbiihoozpQBpQNa8VZvZwPfRXrR7uIYniR9nwrlS
w17eSi//AD/Wodv07jLW6sbmCKaN8dbfC2wFzLwSLQHEry4t7L5IJPFfwGsLjp2ybHQ2toiQG2tD
Z25kXvIsJ4bjZGPrVhGoO/Ot6YE7qvt+h7BcPJj537Imvo71xjA1nGrpwACKrEquo1J2SeRLAg8e
PTUpSlKUpSlK/9X2WlKUpXn8UF1ZWPSDTSZfH9jCPDNJY2BnkRyLb6t1MUnHfFvcA7X3+6s7vBLk
MjfZpbK5MrZmwkgDW5UvH/2ZMhVl5bQLKN+OIeUH3NYW+BnseiMLe3b5G7u7WLHgW7wAvaxie3eV
FjjQMddsb5cmHD/XdvczX2Y6jx15hS9qsVpdxSS5DGThQS9uQvFjGdnRIO9Hi3vo619OWV1B/wBJ
962mj+H6fkhm5xkdt/8AtfS2/ZvS3g+fSfwrT0ZkYMT01axZXI5GD4exgEoylkbWG1ICqUWQxID6
mA8sxOhr7yc8o03UWZsLvpjNIBBaXSNdWjRyxF+5bHtMxVwpZQdHRI1vTAEGN0y0ePy8yRpncfaT
S2/w2PbHO0XA2kCL3JO2xVlIKn6wAFPP3712XTlzB0Xhru4kvrq8tILE9iWNQ1rEssEkyKiIrMdR
Dw3JvQAPJO95jU317mWXNWIurtjbXdpYl5e2YLdGRoWjdlDPCSCYx/h+4DDnYW9xeydS4B8jZzRX
bYicXRigdoYpnMDcO4NqP8KTW2+4fiN6L2yujHnZFtpmHz3ZXSgRkl4o1tGdlHu2hG/hdklSBs+K
rHxuZyXU8+SxM15jVuPiJYJ5Lbh3AEsU4OJY2MfIxSAErv08gGXw1vY4q2OawF1a425tbWPFkqky
sGgaMIkKPsnTKlxcDRPnZ3viCLzL2811i5oLePuSNx4r8ZJa79QP+LGCy/8Aoefb2NacDZ3NjYvF
dQ9pzKWC/OM1740PPOUBh7fZHj7/ALzWFzDK3WGOnETmJMfdo0gU8VYyW5AJ+4kK2h/A/hXGWNr1
HLahLu+ykk8rWq5COO3uYeEhuYe5xlaUjQXvebcKnHZOhwFLY55slZWOats1dyCCaR4LO9+HYv2r
JnbmJYwyiWScABiBy0oAUAdHbm9h6lwEORE1xdx4ieO6uYrZzCZmMB+2FCjfakIB193gbAPOTWmc
zKZmwKXw+cMXdNJaMl1GkFztO3EJ5XKONs6/VcEYA7BXQFhmPi57XHpj5MvZ4mPvB5JoL2aaSTaF
CVjkW4C+ZhtyF9Ptoxmt0SZVM7jjdzZeW47UKyDtNGm+I5vuNmtuJPIMjjmNsUc6iBldQZmHLdMd
VWFna30lxaQS2bILOQmSR4vTwAHqG3Hkew9X2SGNRkGme/jvkTL2sNzmzdRz22OkeVIlsRCWMbRs
V3J6dMuyDsePNdhgLeW06cxltPbJayw2kUbwIxZYmCAFQSTsA+N7Pt7mrClKUpSlf//W9lpSlKUp
SlKUpSlKUpSlKUpSlKUpSlKUpSlf/9f2WlKUrAwxNOs5iQyorIshUclUkEgH7gSq7H8B+FZ0pSlK
UpSlKUpSlKUpSlKUpSlKUpSv/9D2WlKUpSlKUpSlKUpSlKUpSlKUpSlKUpSlKV//0fZaUpSlKUpS
lKUpSlKUpSlKUrlrnqLML1JNbW+PRsbaXcNpNK5jUFpFjPLm0qlSO6ukEbciAA229K0kbGHqp8fD
bJKconbRyEVpHt7f7tgMzM3gEryYgFl3yEWXqXqBvhbC0tIbjIv3mm7duOUQj7W1eF50CtuYeRK4
ICsNhxx6nGXbX+KtL140ja4gSUokolVSyg6Dr4YefceD71Wdb3N7adE5i4x7OlzHaSMrp9pBrywP
JdEDZ2Dsa2AxHE6ehrvKXmDnly3PvjIXSLzUKeImYa8SP4B5KBvwFAGwAzTbmGVusMdOInMSY+7R
pAp4qxktyAT9xIVtD+B/Ct2evrjG4W5urS3ee5VQsKLC8vrYhVLKnqKgkFuOzxB0Caqeir2AdNO0
lxNpcldRmW8iMDSM10/HYKqORLKNAD1EroEEBeYq1vuoWe0TuX8VzDNPfuAWskXgfh421sdxVO0B
0BK7N9pVfpqUr//S9lpSlKUpSlKUpSlKUpSlKUpSlKUpSlKUpSlf/9P2WlKUpSleLdffKRkOnflC
uoLbC4WeWxWNILu4tWadVaMMRzDDQ27eBrwa5yP5YMrF8Z2+nenE+P38XxsmHxG975+v1b5N779z
+NTbb5QsrkIZcPPgekYsdjdzSCWzaS2g9fDkoRm3t5AAUB+3v22azm+XTqyCeSF7HClo2KkojupI
OvDLKQR/EHRrD6euqf3DEf7Mv/JUnHfLV1fk71bWGxwqEq8ju8UvGNEUu7HTk6CqToAk68AnQreP
lY6nayhyk0PTMNy8Ej2sUsUwmkh5acq3LgAWiPpLAsYxoEldwpPlz6viSN5MXi0WZecbNbygOuyu
x9Z5G1I3+IP4VX5X5Vcxdwti8r0zgmSG5Mr201nIvCYOWYlefhuRblv32wO9ndnP17eNDbdQ31h0
Wl/cxG5g72OuHuW4OyKQ4BAblEQNsNaHtSz+W7rG/uktrbGYh5H3oGKRQABskkyaVQASSdAAEkgC
rO7+VDriy6hkwk1t04Zou40ksTPJGiR8i7NxkJGlRiVI56H2dkCo1v8ALD1fPinyLQdPwx8nSFJU
lVp2RVZwvr0Cqsp0xHLkAvI+KhSfLp1ZGkbtY4UiVeS8UdiBsjyBL6TsHwdHWj7EGsPp66p/cMR/
sy/8lScn8tXV+Kyt3jp7HCtLaTvA7JFKVLKxUkbceNisLv5busbGZYbnGYhHaKOUDtSH0ugdT4k+
9WB/91hF8unVkzlEscKCFZvWjqNAEnyZR50PA9ydAbJArD6euqf3DEf7Mv8AyU+nrqn9wxH+zL/y
VYY35Y+qr+Ce5lTp+xtYGSN57iG4K83DFV0jM2yEc71r0+SNjcWX5busYe8WxmIZIJRFJLHFI8YY
70OayFTvixGj5AJFYSfLn1fEkbyYvFosy842a3lAddldj6zyNqRv8QfwqwxnywdUZCxub2Z+nLC3
tpY4me5gujyZw5UARlj7Rt76qvm+XbqeKeSNLXCzKjFRIkEwVwD7jk4Oj/EA/wAKs8t8qnXWEsrW
6vrDp9Pil5CEMxmjPJ1IePu8gQUO/GgfSSGBAz+lTrCK6vYb0dOWSWEqwXE0sNyyJMwY9r0FmLDh
ICQOPoPqO13hL8rPV8Fl37j/AKZhlZXkhtz3S06IzKzI6uYyNo4ALgtx8A7XlCx/y1dX5K5eCGxw
qskE05LxSgcY42kYeH99Idfx1Vnb/Kh1bJiY8pdS9M2NrKqMrTw3TEl3mQDScvO7dz+GtefOqP8A
Kh1b8Ek8MvTM8k0EtzDbpDdB5YY2kDOC2lA1E7aLA6HtsgVpv/la6qxs6wXEnTPdSfsXUYjuOVo+
yCHG/UAQ2zHzHj38rv8A/9TKf5UOrbXI5G1upemYIsbOLae7aG6MXePLSALtyfQ/njr0Hz5G9l18
onyh2Xw/xWMwUXxEV467WQ8Ta8+6h1IfUO341sHkPPvqrm+Wfq23ksu9b4JIb6JZY5zDOUClirEg
Py9LK4OgfsnWwQTsX5X+tvnG+xz47Cx3lisrSQtHISTFsyAESEbCqze+iFOiSQDX/T11T+4Yj/Zl
/wCSn09dU/uGI/2Zf+Sn09dU/uGI/wBmX/kp9PXVP7hiP9mX/kp9PXVP7hiP9mX/AJKfT11T+4Yj
/Zl/5KfT11T+4Yj/AGZf+Sn09dU/uGI/2Zf+Sn09dU/uGI/2Zf8Akp9PXVP7hiP9mX/kp9PXVP7h
iP8AZl/5KfT11T+4Yj/Zl/5KfT11T+4Yj/Zl/wCSn09dU/uGI/2Zf+Sn09dU/uGI/wBmX/kp9PXV
P7hiP9mX/kp9PXVP7hiP9mX/AJKfT11T+4Yj/Zl/5KfT11T+4Yj/AGZf+Sn09dU/uGI/2Zf+Sn09
dU/uGI/2Zf8Akp9PXVP7hiP9mX/kp9PXVP7hiP8AZl/5KfT11T+4Yj/Zl/5K9f6Fz111P0dY5m9j
hjuLnuc1hBCDjIyjQJJ9lH314N8rv7Tsv/J/ox1ydk7x30Dx3XwjrKpW42w7J34fagsNe/gE+PFd
Zc9SWtnnusLmyubO5jye5LR5LISrIWuY5OOpU8aQvsEa2o9yFNLPqOyg6KXGpJZx6tpo7i3lW5aS
eVmcrIqKwgbQaMB39SlNgHigOzO5mLM9H5CaC+vni+dLZksbhAIbFWjuSIoSHO1A9P2U8Kvj7hzm
DvIIJLu0u5O1bZC2a3kl0T2zyV0bxs8RJGnLQJ48tDeqk3L47IYPHNJkkt5cdaPbtbGJ2llczSyK
V0OHH6xQSWBGm0p0A2d91he3sONT4PHI1hEU383WxVyXkO+Pb0F1Jrj5Gxy+0d1D6izcnUOcusnJ
BDB35XdY4o0XiCxYBiqjm3nyxGz99W2NzaxYAQXeZR7WK0uLf5rNuVeR3EhjPILxkVJJBIC7Aqef
FfYtX2q2WJusbcfO8yzSRM90Le1SYQBgQqeXCy8lI5qdABip2eSj/9Xi851Bhsl1dl2tz27DKRSw
S3fa4c2Mvdjl4DfFQyxK3gsyqza5toVM2cDdE2eHT4YyJd3DyA2ic1QiEoRJx2CWVwSDvQAPgAVb
RZyztZsFdvlobua0wl1aSK8UknakKT9pGDpxZfrUTQ2vpIPp0Tsh6jS5xsJj6gfHZuSCP4nJyGYO
/GW45RtJGrOxKPbn711GASCoFbsx1JY3dtnUgzCC2ubu6ligWGVXmLyMV3GR2pFKkHm/GVCBokRo
rYP1XHc5O1y93nZrl48bJBHaXMbzCKX4JomLhwV+slCnQ5BgxL8daNZgc7Nc5m5uMxm+x3sbc2sl
xcdxmn5xsqK5RWZ9Mynbb0EAH2VFbrbqOBcXjcZJd6s0xF3Fcw9s8XnZrhoQ+h69M8TLvYUkkaPI
1YdYFpOnJ57o30bTZCJ7G2u4gIbeEpMWS0cOwkiG4hyQKpAjOvI1zmKls7jB32Kub+Gxea5guEmu
EkaMiNZVK/Vqzcj3QR41oHyPAOadSvaYC8wVtDbS2006tHcTWUIl4ASD1eljyPcBDciU0Qp0awzX
U1zm8fYWk1tZxC0iKFobSGMuecjbBRAVXUmuIOiRy9zWfTuSuLSC7t7fPphmlaOQSvE52VDDayRq
zo2nI9IAKs4JHs2GUTFXsmWy1vN8Ik183wFikS7KFix5AN9WqqVA8EEnQ+yxF7murcf2un7mwlfI
5LGskxubq0WBgyzSOVcIx7hcshJLHXEnfKR9VkZw8lplcRb5RLa2nu4Lq1uLtJCO2iyjg/bQnuDv
KDpeO1bR1x3rv2xN9irIple38220lusElu/enPelkRgBtApEig7fY02g2hywtrW76YyNnlbj4G5i
inUSQW+SglMyeeSMI2Y8WXkp2NabR99G9hztgbfJ2FrlMdbRxS2cVm9/YtPFLFDHKjusZifgzu/c
0QDuRvJOyYr56yjwdtg0urbUWPmjN/Da/WrIJp2EauyB+3KjKpHjXMb0OatGy91YX9jHHNlbO8u5
blDHeCzaGSGIhu4bkqm3ckxkkGU7V9N59UnLXuKymR6ktY8xbRRZDKJf293LFN2mQd7akBC4b64f
5delvPtuzu+t8XdX92w5m1vcffgK6lWguHkvGiJ0DyPC4K6B4/W7J9Pjk7q4tpcdisRDcoI42ee4
uJFbiksvEMBociqpHGDpSeQfXIcamxZuy/6u+elZ0gxyo1hG6+uUwoqW4fXjfoQv5A0H4kHiK5yl
KUpSlKUpSlK//9bxmlKUpSlK+mPki/ZjiP539aSvGfld/adl/wCT/RjrjaV2WN6DF90BP1IZphJH
FPIqCGUpqN4gNkRkexm8htfZ8gJJxt7j5Kkt77AwNc3JXIXaQXB7EwKqYI5GK7hGjvvfa9hx3rhJ
xY/5KkuOo5MdPc3IiitLKdmWCZW5SuiyD1Q+AB3db1r08vsScfPL21exvp7SQ7eCVo2PFl8qdHww
DD29iAfxArqZ7DDjqq+woxSIuJa8KyrPJu6WCOVgJQSfLGNdmPh4L6HlSvM39xbXU6y2tilkCuni
jkZk5bPleRLAa14LN52dgEAdHFYY+Xpi0NpZ4i4vpLGeWXu3M5ueSPKWKqj8F4RKjjmBy+7mdiqL
B2EWSyXZnZxFHBNcOEIDMsUTSFQTvRITW9HW96OtHZmrOCBbC8to+zHkbY3AgBLCEiWSMqCfJXcZ
I35AIBLEcjnB07cT45LoXNssssElzDaMX7ssMfLm4IXgAO3J4ZgTwOgdrtnOnpcDPNbz39jcT287
QTxW8xZo2BOj5A2CAT6d8fZuLHVOm7e2u766gurZJ1OPu5ELMwMbpA8isOJHkFB4Oxonx+GeN6Wy
GVwd3lrQc47TmZE7Mvsih2Pc4dsaUk6LgnXgEkAzb/pAHP2WJw+Qhv5bq2imKospaPcCysxBjBKk
FmUKGbQAI5eCu+hMhju9JkLyzsreHtEzXIlj5CTuBSIyncPqiddcN/5tcdsOcmiaCeSFyhaNipKO
HUkHXhlJBH8QdGsKUpSlKUpSv//X8ZpSlKUpSlKUpSlKUpSlKUpSlKV9MfJF+zHEfzv60leM/K7+
07L/AMn+jHXG0qZFl7+HFyYyOfVpJy5x8F88mjZvOt+8Mf3/AOX+J3vPUeWM1jN8X68dKktse2n1
bKkaKfbzpYYx539n+J2tuo8tZ33xsF3wuO1DFz7aH0wmMxjRGvBhj/14+d7O6yumv8xmLWa3yl3g
YbR7/nLJcyW0i/OIdCsh5M3hWWVt9rgPWD40nGom+IzU8j2OKSKO2gLtDZROyxRqds7ElmI2fLMT
rYGwAAP/0PLLTOPZ2LQRWNmLjtSQrecGEqxuCHXwwRthnG2UsA3gjS6zmzqqmMbH462x9xYwNFLP
FtjdEltmRWJBBVuJBBBBIPp0qwr+/lyE6ySKkcca9uGGMEJCgJIVQd+NknZJJJJJJJJmwdRXEGOS
1FtbNLFBJbQ3bB+7FDJy5oAG4EHuSeWUkczojS6hZO/lyuVu8jOqLLdzvO6oCFDMxYgb342a3YXL
HC3r3Qsra7LwSQFLgvxCupRj6GU74lh7/f8AjoiVZ9TTWditubCzuJI7aa1guZe53IYpQ4ZVCuFP
+LIQWUnbfgAATqe6Rrd/hbNpYohDLKYzzuIhEYRGx36V7RKejiT4JJYBhpu849zYzWMVjZ2drLLF
J27dG9JjEgHqZizb7rkliT7AEAAVWUpSlKUrdbWV1ed34W2mn7ERml7UZbtoPdm17KN+SfFaazih
lncpDE8jBWcqikkKoLMfH3AAkn7gDWFKVmIZWgecROYkZUaQKeKsQSAT9xIVtD+B/Cs/grr4H474
ab4Tu9n4jtnt89b48vblrzr31WmlKUrOSGWJI3kidFmXnGzKQHXZXY/EbUjf4g/hWFKVuubK6s+1
8VbTQd+ITRd2Mr3EPsy791OvBHitNKzhhluZ44IInlllYIkaKWZ2J0AAPck/dSaGW2nkgnieKWJi
jxupVkYHRBB9iD91YV//0fGaUpW68srrH3T2t7bTWtxHrnFNGUddjY2D5Hgg/wDutNKUpSvpj5Iv
2Y4j+d/Wkrxn5Xf2nZf+T/RjrjaV3+JynT8XyW3dlcNCL9orocCh5sxktSpH1w39lDvj/wDxsdHg
wkvbnOdJNlOk3hktgtvkIXduDAQqLa3UFv8AuDxAIQbO9GNt8uDd1hs50lF1hJP3LaKI4/GIkjIy
qGWSAkbNwdFQI9jzx7bb3wbu+U3rQPfTvarwt2lYxLxK6XfgaLMR4+4s3+p967BMQrp01874+5Nm
cFezBfMRkKG6lXixB86MbexGmUkEHyxGKN3lrS5xWNdWv8FfTyW1qryLG3C5gAXZZtEqnuT6n0Pc
AVFrYzTfJ9kbxLGbhBkrcNcp3OBBjlBDDfD0kpo62O7rfqAqzzuKxiX2UjxWF02MzcdlDB3ZZWug
5m9L6Oz5iAXhxOmIJZvVWzN2Fjicj1Vc3+Ke7ntcykVsl3PKBwk+Ibb6IdwVRSDyBJ4nZGw2646Y
xEU+TxtpHbTrZrfma5mvAt3FJAZiiJHyUOpWOIkiNvtv5GvTyWBslyGatrZ+DKWLFGBbuhQW7aqp
Usza4qoZSWYDY3sd1f8AS+OsrKW8t8FbCeVbZvhszM9gsAZrpW0rXAIJ7EZ00jHySNA6FfkcP0/b
YqOW3hszYS211JFkJLsi8dlmnSDUJcbVuESk9r2LHa6JWTlumMJHe2tvY2NzGq3fGGeeBlTIwqrs
eH15M7PwQKYhGpMgHp5prDPYXC4LFvk2wMxmk+GKWl6stssRdrpWDR9xn4kQKwHc3vR2F2hrLfFW
Fx0pdX0GFm0vccXUsrMIwCQq95SI1cencckYLjZVgZI1FZ0ddQWXWeGuboQ9mO+iLtMxVEHMeskE
a4/a8nXjzsbFW1tg5+d9K3SiTZJWg7eGX4hjFEwk5yGNZO6CGSP7Ta1KDrTIa5zM21rZ5y/tbGfv
2kFzJHBLzDdxAxCtseDsAHY8V1V707CM1FaR4VLayS7ZbS8aSQ/OcKhmHFC47zOFXiYii8pAPHNC
N2f6RthZE4zGXMF9MtvObaeNoGt4uVykjFHkfhHuOEl3cgcgdqG0GY6dx1rbZ0WuFft2l3dKt00j
lI1SRlRRKHKIw0v1UicnGyH3JGKi9aYXDYuxHzdZXkPC57dvdSw9uO8i031is0r93ekIeNEXTeQO
SAVnRVldX2buI7S2muHGNvdrFGXPm2kUeB+LMoH8SB99LWxmm+T7I3iWM3CDJW4a5TucCDHKCGG+
HpJTR1sd3W/UBX//0qKDF4SLPZ5LWyewgxU95Zc43aZ3je1vORIZgCV7Q4gcfB0xY+quFzdqtrkS
IYEjtZFD2zRyGRZY/YOGIGySDvwum5DimuI6BcVi4+lbC5ubSxiW4x880l4bwi676yTLEqw9zypK
RqSIyNFjsaJGd7Y4J+tb3CW2H7KWVzdLAPiXZrlkWQpE4Pk8pFRVCcW0Su2YhhZpiJYunrtLTpP4
u8lls5bvE8LlvhG/7xQeKuJF2ixt6mP+Jv2K6pr3FfDdNdS/NyTXOMts3BHFdgc0ZEFwoYuBxP24
/I8etfxFXt90705aXREWIuZIrdbpoJLiN4Yb+OO2mdX5CcmUckjPOJY103kDkoGj/pjDrl2jx2Nf
KRSwN2CvcuUHG4mhErJC6yFWESM0illUsQEPNAvB3saQ308Ua8USVlVe8sugD4HNfS//AOw8H3Fd
hnum8djDPNYW6XrXOUjFhbAu3OEvcDtLxblIGQWz8h54zIQfUC0nsNY9Wda4r5m+cLmbmLa2uTO0
s4F1G4A4uHfafWb8khN71y3Gls7KfG4jF3Voj3K4a9l+KS45dswy3ciiPieBBZCGJ5AqRx4kcjz/
AEvZWWQ6gt7a/wCbQFZG4IOTSusbMkYXalizBV4hlJ5aBBII6lOncYc5K0WDvJFS2Tu4w2Ur3COz
N6xAtyJEQKi7LyE7kU8eLrqv6sx2E6ckXGw4x55HW5U3UlywcFLqeOMgD071GvLYIYD0hDtinxqr
bdMLlrd4ILjDXKwPPuJGmMly0XqOgByeFtk60wJ9Jqp6hxUGKgw6xPDJJPYmS4khkLo0nfmQ6Psd
BAu19J47BIOzuvFxNjgMUDiu7dX9jJLLc/EOGRhPMiFF+yPsANsHYAA4HbG36u6fxdpBFBh8bfd1
rsQWkxtyq38ZDAOhMr94khCGjRF9fkepAJ8uEs7jrPqx8hjLy9u4skxhsorSSdzHI8jGXtpLE3Ea
j03Lj9YPB5AiNadLYufFZRo7O5uIlW8mt72KIzfDrErlI5Zkl7Sse2CQI22sikMOQK5/9OYlrvGL
cYiazt5OYXZcyXTLEzqqgyFblXYIqvC0eyxHFOcZonT+MfOSw2/Tt48htkJtJ7eU9hyzDk1vHOZ0
TQQlizEb3wIkj1w17GkN9PFGvFElZVXvLLoA+BzX0v8A/sPB9xXodhhsdjurMXIcW9tFBnbeDHTp
I6nIwln1Pt+SuAVhYmMKpEhHjkpHn9/cxXE6i2W5S1iXhBFcTiVo12SRyCqNcix0FH2v/ZjUpSlK
+mPki/ZjiP539aSvGfld/adl/wCT/RjrjaVeWvR2avOm5eoIbV2solkct23JKo0asRpda+sJ3v2j
k/8AGpsnycdSQ3OMgksnRslOsEZaKQCNjGkm39PgAOd++jFJ/wCNLX5OOpLvKtjhZPHKkFvOzSRS
BVWZkUA+nwVLNy/DtSe/GuZmhltp5IJ4niliYo8bqVZGB0QQfYg/dX//0/PJemLJMtLi0yzm6smm
W+VrXQUQo7yGIhj3ABGwHLtkkp4G2K0t/DZQzr8BePdQMvINJD2nU7IIZdsAfG/DMNEeQdgWx6dt
Y+nIsrLcZFnktjOwgx4khh3LJEgkl7g48mjPnj9/jdVOOsJcnerawsiEq8ju5PGNEUu7HWzoKpOg
CTrwCdCs8nj/AICSFo5e9a3UXetpivEunJl8rs8WDKykbI2p0WGmOcWdyMGONhHMgi4sisYUMqI2
+SLIRzVTttqCAeTbHqO4FbkvJ0sZbJZNW80qSumh5ZAwU79/Adv/AL/pSe8nuYbaGaTklrEYoRoD
ipdn149/U7Hz+NaaUpSlKUpSlKVunvJ7mG2hmk5JaxGKEaA4qXZ9ePf1Ox8/jWmlKUpSlKUpW6zv
J7C6S5tpOEib0SAwII0QQfDKQSCDsEEggg1nf5G5yc6zXTISi8ESOJY0jXZOlRQFUbJOgBskn3Jq
NSv/1PGaUpSlKUpSlK+mPki/ZjiP539aSvGfld/adl/5P9GOuNpXR2fWM1n0jP08LK2dZVlXvtDG
WAd4W+9CSR2mG979Snx21qfJ8o9zLd4W4bF2Y+armOcqsEI7vGKKMgaj9G+2xBG9ckA/w10sPlHu
bLONk2xdm/K2tIDGsEKf4DRMSCI/HLttoAenkmv8NdchNK088kzhA0jFiEQIoJO/CqAAP4AaFdNN
ncK3UFzmUF80uTa5NwhjRVtVnjkRgnqPdIMmwT298Na9W15+/GPWdUxz3MkSroy3CKjO2yd8FJ4j
Whrk29b2N6Ftjs3a2mNTvXeRluLe2ubeGzfT2476OjOrcgY/D7KhG5FPtDl6cIrrEYd8bd4+e5vJ
ZrSWLIwyxiIRmQPGyxts+eDeCQQDoneyi5x3ODyd9BaZG6vLTGWFjJDbSxwLJLI23kUuvLQ5O7eA
TocVLe8lUFKUpSlKUpSlK//V8ZpSlKUpSlKUpSlKUpSlKUpSlKUpSlfTHyRfsxxH87+tJXjPyu/t
Oy/8n+jHXG0qzisYH6WusgH3cQ30MJUxnwrpKQQ3LXkodgr9y6b3FdHksDbXOUxuAsrvFmM2kdy0
8UTJLEothNKzPIEDh9sy829OgNxjYr//1vP7vpbH2HeurjNdywj7SiS0jiuJQ8nc0rKk3AeIXPiQ
nRTx5IWlzOP+aM5f4zu974O5kg7nHjz4MV3rZ1vXtuugtbK1iyOOtVtoZY4cRPfiZowy3E3w8koJ
3vkqOqxlCSu4n2AWYVGxFnbdV5KY393Y414rSaQiKBou8yRSOG4xoUULxXkAF2o8AsSTrj6ex7dN
X+T+fbNpra5SJEVZ9MCJjrzF9pu2pXyABvlxOhUbpieyts4kt+9tHF2J1V7qDvRJIYXEZZOLbAcq
fsn/AErPqZS9xZ3aywy293bdyBo7GK0biJHQ844/SG5I3nZ2OPn7hYWeNsnx1lZvboxv8Xd5CSc/
4qSQ9/gFP3LqDRGvPcbfkIUosR8B86Q/OX/+N6t75ceXE8OfH1cOXHlx9XHfHzquw6gxVtZdaZee
LG2KQ2kFxcWVtbKxS5KzNHyKOT5jPN2ULwIgb08Dyqpjt7Oz6CivhLjpLi8ubiKWGaGRpWCrFwCN
w0jIXLnTAMGUHnoqMI+nba9nxEMV6lvHd4ua8knkgYcGjM5YMAzbG4SOSgenR473s/TWPgshlZ8n
cjFSrGYZEs1acs7TKA0ZkCqN28vkOfHDx5PGZ1H07jxf5+7hvUhNtkLlVtYYFKQqshCh9NzQHwoI
jMe2RS4JIXC/6cw1x1DbY7G5Ca3R8at1NJc22kTVos3L0u7HlokgD070OWhVfYYvF3WSnht757iI
Y+4uIjLalW5xxO3F1EnpOkLAqzj7Gwdsozi6ZglxdpOMn/3l5Yz3kVt2DxVYWl583342sJK6B2dg
hRpjhmenYsXBdmG9eeXHXYsr1HgCKspD67ZDHmu4n8kIfs+PJ0xEgsOnMjk4oLaS6ju7aBGuLdJ1
VHSdmHBwV2TGnnWxrQPk7zjwuPvOmr/N/OVnaTR3KKlmonIjDCY9vyjbY9teJ5ka3yIOqwzuCscV
jcZdWuYtr2S7gMjpGso39bKnJeUa6XSAaJ5ct+NaNb+mr/GWWKyHxc9tBctPA0bS4yO8dowsocIs
g4A8mjJ2y+AdEkaNRmbWexzl/aXRhNxBcyRymBQsfJWIPEAABdjwAB4+4Ve9R42yt4MvFBbpF8y5
RcfC6faljIm2ZD/mbcO9+PtsPshFV0HDh5768TJRW0kwtJ3hW8WQwBVglZie36uQIQg/cofXr4VF
v7H5tw+QaWxhjvHyT2k8aesWIj9XAElvtsSA296gcAsGare4a3PWmTxBx1j8Nimv2tNWyKyCCKYx
hyAO6NohPc5E8ffTMG5K/vmyE6zyW9tDJx4ubeERK52fPBdKDrQ9IA8b1skno7GytZMFb5k20Jt7
PG3lvcKYxzkn5cUcD2OjeW/knY7ba+yu729+HHX15j1n6fa1gbIskceJRRaGOGXh3fqBzCnR0OYJ
Tfnxuvu5MbY301q8+It8ukUXdvpcf3LKYbkJ7UYiYDkjW+mEYB4OQdNt6y4jks+ms/aXGPs7a4gy
8ELKIUd4NicvGsp5Px3Eg+0fY+fUd9Na22K+e85He4ezubPB31xbwW6RLEWhW2vG4M6jkzfUR6du
TAjYOyd1l1grWxzWCxDRwzWuQxr87sxBfqnnmaO7P3rxQRyHZB4oVYgcq5yyhiuum8l3YkRrNo5o
bgqAWZmCNDvxssDzGydCF9D1MaZSGJsLib8RJBPKskMkaqF7qxkBZtDXghjH4HloWJJYtqppSlf/
1/GaUpSlKUpSlKUr6Y+SL9mOI/nf1pK8Z+V39p2X/k/0Y642lTIsteQ4efEoYfhLiVZZFNvGXLL9
khyvIa2fY/5m/wDI7DL34yEV/wB//uIokhVii6KKgjCldaZeACkEEMN73s1v/wCpMyt98bb5Cazm
EXZU2R+HVU3viqx8QqlvUQAASSfc7r0LF/JnF1/Eepjnkx0uZnubpbE24lZFEzA6bmvIAldnQ+0P
xrzmyyWRE9lDBcIrQMyQGXgFUOdMjM/jtnZ2rHh6n2PU29mWGWusxPaX0O7uz5xPBBEipCI+RcKk
Y4qo07HiNfab7yarK3Wd5PYXSXNtJwkTeiQGBBGiCD4ZSCQQdggkEEGrO06rydplGyAWzkkNtJbL
HJZxGKNHUghIwoVftE+AASW3sMwNfHkr2LHSY9Lh1tZW5PGPYnxv/QEqpI9iUQnfFdWd/kOocamG
Z5LnGpDadzHLDI0ZWNywaRfOwXYMSfvBGvTxAhTZ7KXOakzM948t9KxZ5XAbnsaKlSNFSvp4648f
GteKjPeTvYxWTSbt4ZXlRNDwzhQx37+Qi/8Az/Wpr9RZN47WPuwqLO2ktYTHbRIRFIrK6khQW2Gb
ydnbMfck0tuosnawxQJLDJDFF2khuLaKaMDm7g8XUgsGkfTEbAYgHR1Wc/VGYuUuBNdI7XLSM8pg
j7o7hJdVfjyRWLNtVIU8m8eo7wXqPLLbxwLd6RImi/w05OrRtHp21t9I7KvIniCQuq0YrLXmGumu
bIwiR4miJlt45hxYaYadSPI2D/AkexNI8vfxdjhPr4e2ktYvQvpik5819vO+6/k+Ry8ew1Z5fql8
lg48TGl4luJUlMdxetPHCUVlVYVIBjTTt4JY6CefB3WY/LXmL7gtjCyS65xXFvHPGSN6PCRSvIbI
B1sBiN+TX//Q8cmmluZ5J55XlllYu8jsWZ2J2SSfck/fWFTMflrzF9wWxhZJdc4ri3jnjJG9HhIp
XkNkA62AxG/Jrf8A9QX7Ye9xkphmS+uVuZ55YleZnXl57h9Xnkd+d++tcm5aJMrdXHwaXj/Fw2eg
kMpIUgaGjxIJ9Kqu974qoBAVdTY+sOo4cpeZOLNXkd3fb+IkSQr3PSVGwPHgE8fHp8cdaFVkV5PD
az2qSfU3HHuIQCCVO1I37MNkbHnTMN6Yg2EnVGYkeNzdIGRubMsEamdtFSZdL9cSGYEycth339pt
hnzNO82RxdjkTxVIklV4UgUEnSJC6KoJYkjXvs+5O4Ul/K0FzbRKkFrcTrO0CAlVZQ4UAtttASMP
JPv53Vhd9W5e9mknmezE0vc7k0VhBHI/cRkfkyoCdq7b2fc79wDWm26iydrDFAksMkMUXaSG4top
owObuDxdSCwaR9MRsBiAdHVaznci+Ou7CSZJYr2cXFw0sKPLJIPZjIQX35P3/wCZv/I73y9UZiUa
a6QFldZGSCNWm5o0bNIQu5G4u45NthzYg7JNRVy9+sMcSz6WO2a1QhF5LEzs7KDrY2XbZ9yGK/ZJ
FafjJ/gfghJq37vdKAAcm1oEn3OhvW/bk2tcjtc3k932u/JyEMQijUAKqKPuAHgeSSfxJJOySTpp
SlKUpSlKUpSlKUr6Y+SL9mOI/nf1pK8Z+V39p2X/AJP9GOuNpX//0fGaUr3v5K5ZI8X00ii+MUuP
vVl4pK1uH+J3HsgdtW0JfPg+wPuorzPqOTGZOfLwWMOLt+xmVhx4tzHErQuZubc9+pSViPJiVTel
4qdVvkjguvlG6kBnxcttdLfvHLPcW5ibmrmEo7HiG5tH5U8h53oBqi21zimxeNsJIMcFlxF3JdTF
F7pnVrhoVLnyrArHoDRYMAeS8QN3WkuEaxCYuzs4oxc/9lLFdwvI1vpvtJFGrLv6snvsXB8DZ5mq
bp7IWdh8R8Xcdnnx4/8A4i3vt63v/GYcPce3v9/sKrL2RJr6eWNuSPKzK3ZWLYJ8HgvpT/8AUeB7
Cug6rtrn5uw9xc31ndTR2zxXLRZCG4k7rXE8m24OxO1cEt7bOt7rmaUpSlKUpSlKUpSlKUpSlKUp
Sv/S8ZpSlKUpSlKUpSlK+mPki/ZjiP539aSvGfld/adl/wCT/RjrjaVPiwWRnxxv44UMXFnVTMgl
dF3ydYyebKNNtgCBxbZ9J1KvMKki4UYyKYyZCxM8iyyqQrLLKjty0oVNRcjy+yN7OhusB0xlTO8R
jtkVVVu+95CsDAkgcZi3BiSrjQYnaP8A+LaRZ/qTDIcdDl8pYLbsyG2S5kiETbPIcQRo73sfjuqm
lKUpSlKUpSlK/9PxmlKUpSlKUpSlKUpSlKUpSlKUpSlKUpSlfTHyRfsxxH87+tJXjPyu/tOy/wDJ
/ox1/9TxmldHB1hcQ9NpiC18BFBJbxpDfvFbsjszEyRAettyN55AeFBUgENofPWW8G0Vhco2LgMT
v8ZpnJdpOaFUBjYNIxUnkBpdg6PKwg64+HurwwRZG2hu+00slpkezdSvGHAaSUR8W33G5aQFiFJJ
bkW5m9unvr6e7kGnnlaRhyZvLHZ8sSx9/ckn8Sa00pSlKUpSlKUpSlKUpSlKUpSlKUpSv//V8ZpS
lKUpSlKUpSlKUr6Y+SL9mOI/nf1pK8Z+V39p2X/k/wBGOuNpSs4TEs8ZnR3iDAuiOFZl35AJB0df
fo/6Gu2s4LLFdRdZE395ZSY/uLb3NpbIZIh8XGhZeLRhW0eOl0OLt7AcTCTBYm5wS393f8Mpf209
7FDDG4ChGkHERJCV4ntN6u4gUHfHS+p1D0va4rB3F5DZ5GPsX0dtDezuDb36Msp7sQCDSntqRpnG
nHk+5rOmfRdXtxD5vrexlmsx/wD3UDk2/uZIu5Ip2CGRdbOgZt3eZK2wGGsMdJN8Pd42aa5toxyj
lInnDSOnsWVEX1EbUIpBHEEYZKy6TjtsSbXKXxMsDG6ZbJGYHuSgEr3/AEtoIOOwOOm3s6qF1Rb4
i16jvYcHO81kk8gQlQFUB2ACMHbmutaYkE/hXQWeTlvOm7LCQ32asmXF3blElMVrIqNPKx4g/Whw
DGT6eJU/b9hyVu8uOngu5LRHDKZIRcRko/kqG0fDAMD4O1JXRBGxVt1PZXWQ+UHN2tlbTXVxJkrn
hFDGXdtSMToDyfAJ/wDVdBibaST5Kr94rL4Md1We5ubFJIbnS3G2WVxtG1qMcR6XCAEGViIWNt7W
bqro+wmXliZPh3jHbDid3fUvNSQD9arREkb4Rr4YAbh208Ocz938TeXmQ4425MN3cxRpKzJA7gyA
9zl7FQeXIDiQy8QAgwOKmxdiO5efH3uNub3lte1F2WnOta23JYde68T522+ItmxGIt7DK4UJfBbH
MwRXlx3BJ3RHHdbdVWPcS+liT9YVU703HTf/1uLgx+Askzby2F5dW3zbHPbsLqP2NzGhaOUxerex
54KV+sjZdgkVl/isVisVZC9TIx5O7tpJHUhVS3dJpYwpUjkd9sAjalPJ9e+IlQ4bGXs+ESV7m3tp
8NcXUzIsburxG5JI0q8gTEDpjvR48tAEbrfpjH3VtHkLOwyl+tzAksWMtpla4RTJNGzlxGeSqYBv
UY/xlG/Hq5zM4/5ozl/jO73vg7mSDucePPgxXetnW9e266Dqi5nuepcrYZC6vFwtjkpYYjHAJhaA
GQRxxhmUIpC64hlBCA6PAazfHdGDq7K2/wA5XIx8a3Rt+MClOQSXiFfveoAiMof/AOQ6BC72eTmE
SzyCB3eIMQjugVmXfgkAnR192z/qa7PrTJy52DJ3gvs0IrXKBGs8jKeKNKJmAWLZ7RjEbJrbb3v0
fZqs6WeWxymSsZrREnbH30chmjPdi42021AP2TsDZ1y9OtgFgaKKyup7We6htppLe2496VIyUi5H
S8j7DZ8DfvXofVtlbmx6Z+cbd8NjCyRz201gkVxBGZ5iQj8S8gRPtb9+UbkFpDqlnyGXx9p1Dfdx
8blY8pb2zm0kKGBONwDCjKfEYMaAKDrSL+ArDL3eZtcdjsfAs0HxVjcTX1jHDwjZxcXAdnhA4hlV
B51tBGutcRqp6Xmii6gt455Uhiulks3mdgFhWaNojId/coflrY3rWx7118d/8zdNT2Jy+Rxb4/4C
3knx6blLuLud42XuJx4tKUI5E8o/IG9Lg2Qll6Ps2myl9eTvi7mSTFNtornnPcg3DEv6mjOpD6S3
oVt6DMlZ1Ff3t3BNkba+voFsMgi/AXMXbbGSMJGSOBuRIVe2ynQj+wnp8DjN6gyeQs8j1hkbW+uY
L1c7HbrcxSssoi/7n6sMDvj9Wnp9vQv4Cugy8OPN/PZRxW1pLjsfmJbcKqp3ImkvY2iH4lSI2VRo
Be6fwrz/ACM0seJwOQMrw5JVftyRsQxgjfUMhYeeQYSoPOwsSDQABNmkMUXyhXNl2khtZldMrAig
Jbr2+d0EUeCImEjIPV5iQjlob5ClKUpSlKUpSlKUpX//1+y+SL9mOI/nf1pK8Z+V39p2X/k/0Y64
2lKzhmltp454JXiliYOkiMVZGB2CCPYg/fW64yeQu5557m+uZ5blQk8kkrM0qgggMSfUAVXwf/Ef
hWcV9kkw89pFfzJYPKvdtRccUdj5BMe/V9gedHWl2RsUtbxzYyYppIYbe6uYZZJpAx7ZQOoPp2eO
pWJ0CfA1+Bznsb3D5+4skuEjvMdPIvejm4APETsqx152vj7ydADZArTHk8hFjpMdHfXKWUzc5LZZ
WETt48ld6J9I8/wH4VGpUmPJ5CLHSY6O+uUspm5yWyysInbx5K70T6R5/gPwq6zF11Thjhlvsrcx
S29oxsljuCHtELujISPsttCCN7AAU648RVzZ/L3M8lxdZK5uZ5IDbmaeQyOIyfKhm2VB2QdEbDMP
ZiDDE0qwPAJXETsrtGGPFmAIBI+8gM2j/E/jWcV7dQdns3M0fw8pmh4SEdt/HqXXs3pXyPPpH4Vn
YZPIYqdp8dfXNlKy8DJbytGxXYOtqR42B4/hWC3t0vb43Mw7cTQpqQ+lG5clH4KebbHseR/E1JfP
5qSC2gfL3zRWjI9vGblysLKNKUG/SQPYj2rD55yvzp86fOd58f8Avffbu/Z4/b3v7Pj39vFRpJpZ
UjSSV3WFeEasxIRdltD8BtidfiT+NSZczlZ44I5sneSJbRNDCrzsREjLxZVG/ClfBA8EeKzsssbd
O1d2VtkoFULHFdl9RaLH0sjKyjbsSoPEltkEgERr28nyF9Pe3UncuLmVpZX0ByZjsnQ8DyfurO6y
eQvoLeC8vrm4itV4QRyys6xLoDSgn0jQHgfgKjUqZJmcrL8H3MneP8Br4TlOx+H1rXDz6dcV9tew
/CpR6r6hORu8gmbvorq9YNcSQ3DRmQj23xI8AHQHsB4GqhTZK9uIJIZrh5FlnNxKW8tLIRrk7e7H
ydbJ1ybWuR3pkmllSNJJXdYV4RqzEhF2W0PwG2J1+JP41JtczlbG6N1aZO8t7gxCEyxTsj8AAAuw
d8QFUAe3gfhWEeTyEWOkx0d9cpZTNzktllYRO3jyV3on0jz/AAH4Vuv83d5KBYZ4rFFVuQNvj4IG
3oj7UaKSPPtvX/ylrn81Yz3E9nl763lum5zyRXLo0rbJ2xB9R2T5P4mtMuTyE0/flvrmSXi6dxpW
LcXLFxvfsxd9j7+Tb9zWcmZysvwfcyd4/wABr4TlOx+H1rXDz6dcV9tew/Cs48/mosjJkY8vfJez
LwkuVuXErr48Ft7I9I8fwH4V/9Dx9b26Xt8bmYduJoU1IfSjcuSj8FPNtj2PI/iaC9uhdRXQuZhc
Q8O3KJDzTgAE0fccQAB+GhqsI5pYkkSOV0WZeEiqxAddhtH8RtQdfiB+FYUpSlKUpSlKUpSlK+mP
ki/ZjiP539aSvGfld/adl/5P9GOuNpSlKvLa7h/6FvrCXJospyEFxDZMJCSFSRXYaXgCe4nuQSEP
4Luz6jz9t1DPl4pMghjkzKyY95ImCQ25M3cYAL6QSYmYAcmPkhiDWa5PHnr/AKgvEzkMFhkIr4LO
UnCSiZHCIVCcvDOpOxr0EjehvTbdRwLi8bjJLvVmmIu4rmHtni87NcNCH0PXpniZd7CkkjR5Gt3W
nUdlmLEQ2klm0Jue5aQxLcmS1i0w7bd1uEfgoCkIKkr7gKu6bp7PfMnxH12Xj73H/wD1uS+E3rf2
vQ3L38e2vPvuqy9uPir6e55TN3pWfc8nckOzv1Nocm/E6Gz91XPUKY/5qw6Wmas76Sztjbyxwxzq
dmaaTkC8ajjp1Hvvf3a81QUpSv/R8ZpSlKUpSlKUpSlKUpSlKUpSlKUpSlKUpSlf/9LxmlfTHyRf
sxxH87+tJXjPyu/tOy/8n+jHXG0pUzEYq6zeUhx1knKaXkQNE6CqWY6AJOlBOgCTrQBOhV7F0xJh
85PjcxaJMJsXdXMDsJYiCkMjK4VgjAh4iNOuiNnRBBqsi6duJcAcwbm2jiLMqI5fblQSV58e2raD
EIzByANKeS8pOe6KzHTlil3fxcUMohkHakTtyEEhduqq/wBlvMZZfHv5Xc3oHo2Pq+8uo55po4rb
s7MSOSecyKfIRgPRz1vXnR+yrEcze2r2N9PaSHbwStGx4svlTo+GAYe3sQD+IFTcrZwW2Ows0MfF
7qxaWY7J5MLiZN+fb0oo8fhVh01BinxWQnvkxbzxzwKhyM8yKsZWXmVSFg7nkIh4Da3sgDZFLk7e
W0yt3bT2yWssM7xvAjFliYMQVBJOwD43s+3uasOobPG20GHlxkcyx3NiZHeY+uRhPMnMgeF2EHpG
9e22O2NNSlKUpSlKUpSlKUpSlKV//9PxmlKUpSlKUpSlKUpSlKUr6Y+SL9mOI/nf1pK8Z+V39p2X
/k/0Y642lKk46/lxl6t1CqOQrxujg8ZEdSjqdaOirEbBBG/BB0asLTqMWeUa9iw2OCfDSWy22pRG
qupVzsOHZiGcbZjoNoa0utNtnHtcXLZJY2ZeWIwm5KN3O2W5FSA3B/PkFlZgdEEcV453+VuM/Osa
4y2+Nu5+cslvG7TXczE+fJOiSx9MYUEn28LrRZZHKdO38ptme0ukZUkV4hyVkkWQAhh4IeNTr+Gj
94qBW6e6e4htomGhbRGNfUx2C7P7EkDyx8LoffrZJO7H5COy7iz42zv45NHt3IccSN6IZGVh7nxv
R+8EgESp86t5jsjHe462uMhf3YumyLbWVD6iygAhdEt+GvfYPpK55rLtkMfYQPgrOwSGIi2lh7+2
i5yEgdyRgV5s/nW9jW/GqpqV/9TxmlKUpSlKUpSlKUpSlKUpSlKUpSlKUpSlKV//1fGaUpX0x8kX
7McR/O/rSV4z8rv7Tsv/ACf6MdcbSlKVf2tjNN8n2RvEsZuEGStw1ync4EGOUEMN8PSSmjrY7ut+
oCrDqPDY5p8vb4fFvBJjsythAkcjyvOHM3gg72QYgFCgHR03M+qpsuKu7r5T+qLQY25mlZclIqos
qum0kaNhwI2GJRdHasJNaOxVfbY3Ey4vG2xx/wD3V5iLu8lu+8/JWha4KcF3xG+yFbYOxrQU7Y7u
tMLhsXYj5usryHhc9u3upYe3HeRab6xWaV+7vSEPGiLpvIHJAKbp75u/7j5w+aP8vD5y+L/jvj8P
/wCt8v4a++qy97fx0/Z7Pb7rcOxz7et+OPP1cfw5ede/mum60sc4Mdgb3LWF5CRYmF3mt2iVG+In
KxgaAXSa0o1pdaGtVydKUpSlKUpSlKUpSlKV/9bxmlKUpSlKUpSlKUpSlKUpSvpj5Iv2Y4j+d/Wk
rxn5Xf2nZf8Ak/0Y642lKUqTHjMhLjpMjHY3L2ULcJLlYmMSN48FtaB9Q8fxH40GMyDTvALG5MqT
rbtGIm5LKSQIyNeGJVtL7+D+Fbo8BmpcjJjo8RfPewrzktltnMqL48ldbA9Q8/xH41h8zZX5r+dP
my8+A/e+w3a+1x+3rX2vHv7+KlZXpfNYa9tbS8x1yst2sZgXsuO6zKrcF2BtgXCkD2bxWhMFk58r
c42ysrm9ubZnV0t7eRmAVuJPEqGA3r3AI35ANaRjMg1k96LG5Nqiq7TiJuCqWKAltaALKyg/iCPu
pdYzIWMFvPeWNzbxXS84JJYmRZV0DtSR6hojyPxFf//X8lx+GyuX7nzZjLy+7Wu58NA0nDe9b4g6
3o//ACo00MttPJBPE8UsTFHjdSrIwOiCD7EH7qsM1hvmZbD/ALyG6N3bGZjCdohEskZUN7Noxn1D
wfuJGiaylKUpSlKUpSlKUpSlKUpSlKUpSlKUpSv/0PGaUpSlfTHyRfsxxH87+tJXjPyu/tOy/wDJ
/ox1xtKUpXU23VUEXTcNlt4rm2tJrRVSxt3MqyNIS3xDAvGNSkFFB2FOmUuSpepceJbVCb5orSCa
yVn4sZIpYWiMpXfiRQVAXZBRY05Dt8mzx3UWMsLWfFpc3j2jdpo7m6x8F0QUMpKrBIxWNT3idhyd
qT/nIXdmOprKSCyv0hmnylxY3aNI10hSITz3IYOixjb8JSQQVHqU8deDTZO+xWTaznc3kVx2reC4
0iskSRRLESvqBkZgobR4BfK+rfIWGRzeFyeRzqSS30Nlk8gt/HMtsjyow7voMfcA19cfVy/yDx6v
TuyXWsWTysV48dzHEtpkUNvyDLHLctcEFfI2NSxgnQJ4e3gVX57NWWRsUS3lvJLiSUSTNLEkW9A6
EhQ6ncFm+tZUY7be+QCVmPvray7nxGJs8hz1x+JeZeGt+3bdfff379vuqNNIss8kiQpCrsWEaElU
BPsORJ0P4kn+NXOdusLc43GQ467vpZbGA25FxaJErqZZZOW1lbR3IBrX3b391UdKUpSlKUpSlKUr
/9HxmlKUpSlKUpSlKUpSlKUpSlK+mPki/ZjiP539aSvGfld/adl/5P8ARjrjaUqfgsS2by0VgsyQ
hleR5HIAVERnY+ogb4qdbIG9bIHkXV10ljLKC4vJ+oEa0gaBR8PHHPKxkEvp1HKUDAw713NcW3sN
6DJtOl7XDZC5tcrc96++ByLQwR24khPaSePkXZgVYPEzDSH2U7BJ4xsXgsdc9Q9J20sqG1yixvP3
EeMue/IjIeLN5JTiGHEaKkhfJqlzc6z5ElXsZiqhWnsYDDFKfffAqvEgEL4VQeO9EkseqxfSmHuv
k3uc1NNq+SK4dT3IxxKSQBRozA+zMPK7+t9ie3z5zpieyts4kt+9tHF2J1V7qDvRJIYXEZZOLbAc
qfsn/Ss+plL3FndrLDLb3dt3IGjsYrRuIkdDzjj9IbkjednY4+fuH//S88x9zbrgH+KsLaOxWCaJ
pGiRprq6IYxmNyvNQnKIsAwUBPPmQK1Ricf86ZAWxl7SLFJNI4XkQkaNI+hsbbip0NgE62R71dN0
vjYsWcxNmZkxzdown4Pc8gdp01wD8Qwa3bwX0VO979B5yaNYp5I0mSZUYqJEBCuAfccgDo/xAP8A
CupXomCW7u7VMx23x0ssF/JNbERxyJFNJ6CrMzp/27gsVVgCpCnZA04zpbH5T4m6hzXGwg7amSWO
KGUO/PSlZZkT2jY+mRjor4+0FQdGmaxv5PnGH4i177whXiMV1HCCWeMmQSMp4OAVjKkr5I9XHdf9
NYq66lssXiLyaNZbGK4na5iWNUUWqzMwJlILMOR0xVVJ1y4+oYXXSWMsoLi8n6gRrSBoFHw8cc8r
GQS+nUcpQMDDvXc1xbew3oPMzRrFPJGkyTKjFRIgIVwD7jkAdH+IB/hWFKUpSlKUpSlKUpSlKUpS
lKUpSv/T8ZpSlKUpX0x8kX7McR/O/rSV4z8rv7Tsv/J/ox1xtKVus7yewukubaThIm9EgMCCNEEH
wykEgg7BBIIINWd9d52+tY4p15W95ELqKGCFFThEZl5KiABFB75IAA8sx991Ngy3VN/Y398hhnSX
v92aS3gMpDgtMIiy8+IDszCPwocsQOWzXxZzMXN3iEt+DXONZEx6wWkYcNyDKPSu3PLzpt7JP3sd
wosbezXJt0t3Eoga44P6T2xGZS3nXjgOQ/Ea1vYrBb26S1a1S5mW3bfKISEIdlSdj28lEP8A/wAL
+AqzusVl+lroXEslnFcQymFo472Cd1OiGV41ZjxI2rBho70ffVSsLmc/c5p7qwtba8uRaSQCE2cR
ijjcFSEj0EUln8AD1M/HTFyGr16hyAxceNYWclvFE0UZlsYHkRWZmIWRkLjyzEaPgnxqoVneT2F0
lzbScJE3okBgQRogg+GUgkEHYIJBBBqTe53I38D29xMnYdo27McKRopQPx4qoAUfWSHSgAliTs+a
gV0151rdSYlMfZG8hjP2kuLw3EcQ7TxFIVYfVpwlcaJY6Cera7NLj8teYvuC2MLJLrnFcW8c8ZI3
o8JFK8hsgHWwGI35NSo+qMxHBLEbpJTMsqNNPBHLMFkDdwCR1LqG5uSAR5Zj7kmsE6jyyR28a3el
t9cfq09YClAJDr6xQhKAPyAVioHEkVrvc7kb+B7e4mTsO0bdmOFI0UoH48VUAKPrJDpQASxJ2fNQ
KUpSlKUpX//U8ZpSlKUpSlKUpSlKUpSlKUpSlK+mPki/ZjiP539aSvGfld/adl/5P9GOuNpXZWcu
EXopU+Ds5ZDbTfEyy3cKSLccn7fFDG07aHZI7bBCfDaHcNTbi5wF3mcuOxiIY7TJSR4sRJGsbBo7
ngzH2dDKsBJclFB16UJFHIvMlYW17NgmkXp+6inAls1hjkL3BiClSI1fk0R9Om8knxyrn7jI2Z6C
sLAWdm10L65Jk7kndjBWAh+PPj6tFfK60njR2Tp6PyVrh+r8VkL4f9tb3KNIeIbgN/a0VbevfwN+
PBB0Rc5TqPH5DqoX9nDwhGEe2I+qj9Zs2QjwkY9LNx9iTx9Pgqg42v/V4jqKUZWCaa6+ZRfXuQSS
0axmQKyOJDMzsW5KC5iOpiCuyAFAYCM+N+bY8x0re3tnBdx30MpmMvKEiJZVcBlBPLUobjrfpZdc
9IajP38WV6jyeRgV1iu7uWdFcAMFZywB1vzo1ApSlKUpSlKUpSlKUpSlKUpSlKUpSlKUr//W8ZpS
lKUpSlfTHyRfsxxH87+tJXjPyu/tOy/8n+jHXG0pSlKUpSlKUpSlKUpSlKUpSv/X8ZpSlKUpSlKU
pSlKUpSlKUpSlKUr6Y+SL9mOI/nf1pK8/wDlG+TnqzPdd5HJ4zFd+0n7Xbk+IiXlqJFPhmB9wfur
mfoi67/Iv1cH99Poi67/ACL9XB/fT6Iuu/yL9XB/fT6Iuu/yL9XB/fT6Iuu/yL9XB/fT6Iuu/wAi
/Vwf30+iLrv8i/Vwf31//9Di/oi67/Iv1cH99Poi67/Iv1cH99Poi67/ACL9XB/fT6Iuu/yL9XB/
fT6Iuu/yL9XB/fT6Iuu/yL9XB/fT6Iuu/wAi/Vwf30+iLrv8i/Vwf30+iLrv8i/Vwf30+iLrv8i/
Vwf30+iLrv8AIv1cH99Poi67/Iv1cH99Poi67/Iv1cH99Poi67/Iv1cH99Poi67/ACL9XB/fT6Iu
u/yL9XB/fT6Iuu/yL9XB/fT6Iuu/yL9XB/fT6Iuu/wAi/Vwf30+iLrv8i/Vwf30+iLrv8i/Vwf30
+iLrv8i/Vwf30+iLrv8AIv1cH99Poi67/Iv1cH99Poi67/Iv1cH99Poi67/Iv1cH99Poi67/ACL9
XB/fT6Iuu/yL9XB/fT6Iuu/yL9XB/fT6Iuu/yL9XB/fT6Iuu/wAi/Vwf30+iLrv8i/Vwf30+iLrv
8i/Vwf30+iLrv8i/Vwf30+iLrv8AIv1cH99Poi67/Iv1cH99Poi67/Iv1cH99Poi67/Iv1cH99Po
i67/ACL9XB/fT6Iuu/yL9XB/fX//0eL+iLrv8i/Vwf30+iLrv8i/Vwf30+iLrv8AIv1cH99Poi67
/Iv1cH99Poi67/Iv1cH99Poi67/Iv1cH99Poi67/ACL9XB/fT6Iuu/yL9XB/fT6Iuu/yL9XB/fT6
Iuu/yL9XB/fT6Iuu/wAi/Vwf30+iLrv8i/Vwf317n8nOIv8AA9CY7GZODsXcHd7kfNW47ldh5Uke
xH3101KVzNpZ425z+Zv8jHD8RaZKGG2uZDxkiBggKxo/uFZ3b0g6YuwIPIg8/Jjsafk/xFwtpZyZ
PJxY6SdJW4fHEz25dptA8/Uw27KxHM/+RBvcdj4sb1Pioo8XY4xnx988kFjoxcu7aje+CbJAHniP
w+6q/JZG8TqG8mWzvHe1y9naQ3qyRiKCGT4fuRlS4Y8u62/Qdkxnf1alIuOt8fJ0/ibZbZLbIZXF
293NdyMqQ5BhJB3IpiDt2kZ1Usyt4mbXLbKep6Z7EVveWUOPhx72dz25ra2kLwIxjR/q9hdKVdSQ
FX1Fjo75HC6uuoU6stLe3sbZsU0Ehkka4YHYaLyfqjpgC/FeWmGySONYYHKX99fPFdXXdQRFgvzF
dWXnY885WKn3+yPP3/caqflMmWKxx3cydtbxm7hJtpr42hlIniPMOvq0g3v7gH5+6LuzsZFus/je
/DcwRJixPYwXRJl5khZTJyJPcRWiXZO/rpBttnXOSY7Gn5P8RcLaWcmTycWOknSVuHxxM9uXabQP
P1MNuysRzP8A5EG9x2PixvU+KijxdjjGfH3zyQWOjFy7tqN74JskAeeI/D7qr8lkbxOobyZbO8d7
XL2dpDerJGIoIZPh+5GVLhjy7rb9B2TGd/VqUi463x8nT+JtltktshlcXb3c13IypDkGEkHcimIO
3aRnVSzK3iZtctspsJuxb9NX8drj4cdf4y+jFvb20haEXbCMxJGdLxSTuoj6CD6yTfuWPZ0pSlKU
pX//0vZaUpSlKUpSlKUpSlKUpSlKUpSlKUpSlKiyYzHy5GPIyWNs97CvCO5aJTKi+fAbWwPUfH8T
+NYRYbFQSTyQ4yzje5lWaZkgUGV1bkrMdeWDeQT5B80yGGxWX7fznjLO+7W+38TAsnDet65A63of
/K//0/W4sZj4YOxFY20cXJH7axKF5IFCHWvdQiaP3cV17CsI8NiovjO3jLNPj9/F8YFHxG975+PV
vk3vv3P41us7K1x9qlrZW0Nrbx74RQxhEXZ2dAeB5JP/ALrfSsJYYp0CTRJIoZXCuoIDKQynz94I
BB+4gUkhileN5IkdoW5xsyglG0V2PwOmI3+BP41Fiw2KgknkhxlnG9zKs0zJAoMrq3JWY68sG8gn
yD5pkMNisv2/nPGWd92t9v4mBZOG9b1yB1vQ/wDlZxYzHwwdiKxto4uSP21iULyQKEOte6hE0fu4
rr2FYR4bFRfGdvGWafH7+L4wKPiN73z8erfJvffufxrO3xmPtIIILaxtoIrZi8EccSqsTEEEqAPS
SGbyP/I/jUqlKUpSlKUpSlKUpSlKUpSlKV//1PZaUpSlKUpSlKUpSlKUpSlKUpSlKUpSlKUpX//V
9lpSlKUpSlKUpSlKUpSlKUpSlKUpSlKUpSuMyXXhsev4OmxDCY5JYI2czRB9yJKToGQH3EPgrv7X
gl4+X//WvLf5VXuLHPTrbWwbH2jz2478JDMJ5I1DamOxrs/Z9zy1vnHyZD5VXt+nI8jBbWxllu72
BVaeFl4xI7Rn0zeST2t63v1cftx8vQrK6S+sYLuMaSeJZFHJW8MNjypKn39wSPwJrmbnM3+Ix/WG
RkvJrz5tlItIZIFZY/8At45ANRqGK8pdEknSqCSNEm9wjSyY4PJeXN2rMTHJd2pt5uPtp14r52Do
8V8cfB+0cGzifOkllFY3k6QyrDPcxIpjhkZVYKw5cz4dCSqlQG2SNNqvbrW0W2jn+br4rcrHJZAC
Ld4jyRxhk9fpG5o/EnA6b28HSHrW0vXgjxmOvshJOryBIREhVFETBj3HUaZZ4mAB3ptEAggZy9a4
eK+xtuZdpk4opLebuxjkJTqP6ssJTs68hCBvyRptML1DkMjirq7mwV4JILmWJIkaAGULM6aXcuuS
hRy2QCd8djVRupOp76x6YvJ7fG3NlkjBO0Edw0TGNY4i7THgzjiPAG/d2RToMDXU1Sr1CkVvmbm5
hmVMZcmEp21Da7cbA8uZXieYbkxQKD6uPEtU3FZNMtYrdJBNAG1pZeJ2CAQVZCyOpBBBViPOt7BA
qc51FNBKLXH21yxiyFpbXN2oj7URkli5IQzciTHIPKqQOY8gg602fyiYK/S6e3d5BBAbheEkTmWM
EDlpXPaG2Xfd4aBJOgrFZj9SB8Ta38VncxrcXdvAeaI4VZXUK+1k4urB1AZGfRYeDxYDevUMT5a4
x0dhfSfCzpBPOkIMUbOiMp3vZB5gHiDx0S3FdMayy+UTBZAyrbO8jBVaBEkidrgM6xroK5MZLSRj
UvA+rzri3Gf09k7zJT5j4uCa2+HvhFFBN2+cS9iFtEoWB2zsfc/a/wDQuq5wdb4wWV7eywXMNtaN
w7r9vi78lXgSHPabbp6Zu2Ry2QArcYv/AFyt4uMlw+Omvkub57W4SKWB2jKwtIFDiXgWICtsMw0G
B02hXW1z8/WNlDj8bdpaXk3znbJcW8UaoHIZ4UVTyYANyuE+/XhvPgbs8Zk0yUc31E1tNby9qeCb
jzibirAEqWU7V1Pgn7X47AqZcvcXHWzYiG5ubdbWCGXiLF3imLmTmHfjoAKg4EMo5FgeeioN1tj4
7aO5ms76OC4WOS0cRK5uonkjjDoqMW0DNGeLANpvCkggXNheNewM8lnc2ciNxeG4UBlOgfdSVYaI
8qSPu9wQK+LNXj9X3WGONmNrDbQyi6Bj4guZdk+vlxPAKNLvYbfjRqB091cLnpyzuMhDcrcHFi8M
sqpEt1wRe6y7ICgMwG34KeQKkr5rX/1yt4uMlw+Omvkub57W4SKWB2jKwtIFDiXgWICtsMw0GB02
hXW1ovIJLm1eGG7mtHbWpoQhdfO/HNWXz7eQfeuQw+dysEHTr3M19mJMri5Lt4UhhDGTVuQAQEVV
UPJ9oje9bJ4irBflAwEmUtrGK45/E9kJLzjXzKqtGO2zCU7Dp5VCBy8kabjnF1tj2wvzzNZ31rYv
Ak0M1xEqLLyKqF2W0h5Oo25VTvkCUBYWGBz9l1FYvdWLbEUpikXmj8GAB1yRmQ+GU+lj76OiCBoy
XVOPxWctMTdnhJd8BG/ei93Yoo7fPuHbADYQgb8kAEiNF1tj2wvzzNZ31rYvAk0M1xEqLLyKqF2W
0h5Oo25VTvkCUBYf/9f1LA5+y6isXurFtiKUxSLzR+DAA65IzIfDKfSx99HRBAwl6it4s+MOLa5k
lCqzugTSBiAG4cu4y7KguqlASdsOLcYs/WeNt8fjb14Lwx5K2S5iWOLm4VnhQAqCSW3cJ4Xfs2tn
QOm86tuY58fFa4W8lllvntbu2Jh7kJEDShQe4ELEcG2GI48gdNoVMyXVOPxWctMTdnhJd8BG/ei9
3Yoo7fPuHbADYQgb8kAEiHf9XSJ01kMtY4q8YRWL3dnLKidq4QDYfw+1XRVir8XK70CQQLC9zM1r
jbS7ksLm2a4u4bd45FjdoQ8oTbcZNaOwNqWI5A8Tois2zifOkllFY3k6QyrDPcxIpjhkZVYKw5cz
4dCSqlQG2SNNqTkb+LGWTXUyu4DJGiIBykd2CIo3obLMBskAb8kDZqgt+pL4DIS3VncwBMzb2SRS
JE7W6SJB9rjJogtIfIZiOYOiAQN0uXuLjrZsRDc3NutrBDLxFi7xTFzJzDvx0AFQcCGUciwPPRUR
cR1M9xaZPNXE941rbyzI1rJYNEqBJWSMo7hfdV3JzJCk7JjCkV0GKyaZaxW6SCaANrSy8TsEAgqy
FkdSCCCrEedb2CBNpSlKUqFLiLCbKR5OSDd3Hx4Sc28cVkVfG9e00n3f5v4DWkdOYkQ30PwnoyMT
xXI7j/WKzyOw9/G2mkPjX2v4DS56cxN5Y/BT2nO37s0vDuOPVMJBIdg78iaT/Tl41oas6pW6Zhkt
85bzX95LHm+XeVu2O1yj7Z4aQf5Ao9XL7IPuTu6qsbBp86SXsV9eQJNKs09tE6iOaRVVQzHjzHhE
BCsFIXRB224UfR1kiwI93eSx2faWzjdkAto0ljkEakKCykwxglyzaX3BJJjL0LYw5a3lt5LmGyig
kQxw3ksLqxS2jQKyEMVCW/kMx8kHz90ybpO0edTbXVzZWvfgneyt1iEMjwlOB8oWUARRjSso0vt5
JO9Omsfu5juA93Z3DO/wNxxeBGd+45469RL+rbluJ8LxBIrRfdFdN32KlxxwtjDFIsgVobWNWiZ1
Cl09PpbQXz//AFH4VdQwxW0EcEESRRRKESNFCqigaAAHsAPuqshwAhfJuMpfcslOs5YMimB1CqpT
ig8AIg03IEL5B225OKxiYq1aFZ5rhpJWlkkl4gszHZPFQqrv3PFRs7J2xJMK86ZhvL5rgX95bxyX
MN1PbRdvtzSxFCrMWQsP8KMEKwGl/Ekla9NJaWptYsrkRDHEIrRBKqi0VSCoXio564qPrOfgEHYZ
g2EvS0cuJGPGUvoybtbx7hO1zeRXDj09vgo5hWIVRsgk7LMWs7Swis7m9njZy17OJ5AxGgwjSPQ/
hqMf+91WRdKW8dl8EchfPbRKi2kRdAtoEZWj4AKORUomjJzPp15DNy//0PSF6ZZbS4t/ni+c3t2l
zd3BYRzOFVFCK0QTgCI0BIGyOQ8Egi9qiPSlu5mafIX07OsawvI6FoBG/cj0Qu5CrAEGXmff/wAn
5b5MAJbSNJMpfPdQz9+O9ZkMqPxKbC8O2BwYrrhryTrkeVWcMSwQRwoXKxqFBdy7EAa8sxJJ/iTs
1yt90HBLBbpb3t4fhuzBDHJcFEhtlnhkKIUAIYLDpX3zO/Ux0CvR2GOtsZA0NqrgO3N3klaR5G0B
tnYlmOgBsk6AA9gKR2EUeVnyIZ+7cQRQMpI4hY2kYEfx3I2/9BVTH0dZIsCPd3ksdn2ls43ZALaN
JY5BGpCgspMMYJcs2l9wSSegqvuMPFPlUyK3NzDJxRJkicKs6ozMgbxsBWZjpSOXIhuQ8VCbpHHt
ZY6171yBjbQWtu4ZeS6aJ1c+NFlaCMjxx99gg6pH0tGkUhbKXz3j3fxi3rdruxydoQ+AIwmu2Cui
p9yffREr5onTMWV3DlrxLS1tmgayLB0mJ46dmbbFhr3JJ9vI2wazqssMDa475s7MkzfNli1lDzIP
JD2/LaHlvql9tDyfH4Rcd0pb4oW8VnkL6K2iWISW4dAs7RoqK7sF574xoCFZVPHyCCwMpcDar09b
YRZJhDaRQpDLsdxTFxMb+2iwZFPkaJHkEeKk2Fm1lAySXlzeSO3J5rhgWY6A9lAVRoDwoA+/3JJr
7zpmG8vmuBf3lvHJcw3U9tF2+3NLEUKsxZCw/wAKMEKwGl/EkneuBtV6etsIskwhtIoUhl2O4pi4
mN/bRYMinyNEjyCPFSbCzaygZJLy5vJHbk81wwLMdAeygKo0B4UAff7kkxrnBpdZSK9e+vAkUomF
sHXt9wLxDAleaePBCsqkbBB5NyorPosvk4rm8htrVbVVWNrSd3M3GaGVRxkH1MamAaiUsoEjAEa2
11cdO280s88dzc29zLdi8SeMoWhkEIh9IZSpBjBGmB+0T4OtaJulLeSdWjyF9DB34LiW3Do6zyRF
ODOzqz71FGDphvj+JJOdt0xawWMuPlury6sHtjaR2ksgWOGEjiUXgFJ9IADOWYAeCNttd9OG8xa2
UuZyJf4mO5a53EZGZGDINFCiqCqHSqNldne23vbBp86SXsV9eQJNKs09tE6iOaRVVQzHjzHhEBCs
FIXRB225ORsIsnZNazM6AskiOhHKN0YOjDexsMoOiCDryCNiqmTpJZbGe3fNZEyXF9Hey3OoO4zx
hAg12+IUdpD4XZK+TokG2jsIo8rPkQz924gigZSRxCxtIwI/juRt/wCgrTHh4oMbLYwXNzEJJ5Zx
KjgOjvK0pIOtEBm9iCCPDBgTvPFYxMVatCs81w0krSySS8QWZjsnioVV37nio2dk7YkmbSlKUr//
0fZaUpSlKUpSlKUpSlKUpSlKUpSlKUpSlKUpX//S9lpSlKUpSlKUpSlKUpSlKUpSlKUpSlKUpSlf
/9P2WlKUpSlKUpSlKUpSlKUpSlKUpSlKUpSlKV//2Q==

------=_NextPart_000_00A2_01C34B9F.E5ADED10--

0
mjain1 (2)
7/16/2003 8:16:50 AM
comp.soft-sys.ace 20326 articles. 1 followers. marlow.andrew (167) is leader. Post Follow

0 Replies
1180 Views

Similar Articles

[PageSpeed] 9

Reply:

Similar Artilces:

RE: [ace-users]: ACE 5.4.2 and ACE 5.4.3 compile failed on Solaris 9 x86 and Solaris 10 x86 #2
Hi, > > > ACE VERSION: 5.4.3 > > > > > > HOST MACHINE and OPERATING SYSTEM: > > > Solaris10 X86 > > > TARGET MACHINE and OPERATING SYSTEM, if different from HOST: > > > COMPILER NAME AND VERSION (AND PATCHLEVEL): > > > Compiler: SUN CC 5.6 > ^^^^^^^^^^^^^^^^^^^^^^^^ > > I don't think the DOC group supports this compiler anymore.. More > particularly this compiler is buggy and you may land up with > unresolved > symbols even if you get past this part. I missed the compiler version. But, Forte 8 gives output of SUN C++ 5.5. Maybe we should add a check to one of the Sun config file to check the SUN CC version? Something like: // Forte 6 is the oldest Forte version we sopport #if __SUNPRO_CC < 0x530 # error Your SUN CC compiler is too old, upgrade to a newer version #endif Johnny ...

RE: [ace-users]: ACE 5.4.2 and ACE 5.4.3 compile failed on Solaris 9 x86 and Solaris 10 x86 #2
Hi, > > > I don't think the DOC group supports this compiler anymore.. More > > > particularly this compiler is buggy and you may land up with > > > unresolved > > > symbols even if you get past this part. > > > > I missed the compiler version. But, Forte 8 gives output of > SUN C++ 5.5. Ok, the problem is in platform_sunos5_sunc++.GNU, when a not known forte version is found, it defaults to explicit. I am updating right now, for 4.2 and 5.3 we default to explicit, for all others to implicit Qinghuajin and other Forte 9 users, you can work around this by added the following line to your platform_macros.GNU file. templates = implicit Regards, Johnny Willemsen Remedy IT Leeghwaterstraat 25 2811 DT Reeuwijk The Netherlands www.theaceorb.nl / www.remedy.nl ...

RE: [ace-users]: ACE 5.4.2 and ACE 5.4.3 compile failed on Solaris 9 x86 and Solaris 10 x86 #2
Hi, > >> It's almost up. There are some issues with installing software as > >> we don't have the media in a compatible form yet. We also don't > >> have Sun CC, and we need to purchase a licence if we need to > >> support Sun CC. > > Ok, that's fine - thanks for the update. I think some other folks > (e.g., LMCO ATL and Remedy) have Solaris 9/10 and Sun CC, so we may > not need to worry about running Sun CC on our machine. Johnny/Gautam, > can you folks please confirm/deny whether you've got Sun CC on Solaris > 9/10? We are running SunCC (Forte 8) on Solaris 8. We have Solaris 9 available, but have had no time to install it on our build system. Johnny ...

Re: [ace-users]: ACE 5.4.2 and ACE 5.4.3 compile failed on Solaris 9 x86 and Solaris 10 x86 #2
Johnny- > > > > ACE VERSION: 5.4.3 > > > > > > > > HOST MACHINE and OPERATING SYSTEM: > > > > Solaris10 X86 > > > > TARGET MACHINE and OPERATING SYSTEM, if different from HOST: > > > > COMPILER NAME AND VERSION (AND PATCHLEVEL): > > > > Compiler: SUN CC 5.6 > > ^^^^^^^^^^^^^^^^^^^^^^^^ > > > > I don't think the DOC group supports this compiler anymore.. More > > particularly this compiler is buggy and you may land up with > > unresolved > > symbols even if you get past this part. > > I missed the compiler version. But, Forte 8 gives output of SUN C++ 5.5. Hmm.. Then I could be wrong. Then we need to fix the config files for SUN CC to use implicit templates for anything including and above FORTE 8. > Maybe we should add a check to one of the Sun config file to check the SUN > CC version? Something like: > > // Forte 6 is the oldest Forte version we sopport > #if __SUNPRO_CC < 0x530 > # error Your SUN CC compiler is too old, upgrade to a newer version > #endif Much better. Thanks Bala ...

Re: [ace-users]: ACE 5.4.2 and ACE 5.4.3 compile failed on Solaris 9 x86 and Solaris 10 x86 #2
Hi > > ACE VERSION: 5.4.3 > > > > HOST MACHINE and OPERATING SYSTEM: > > Solaris10 X86 > > TARGET MACHINE and OPERATING SYSTEM, if different from HOST: > > COMPILER NAME AND VERSION (AND PATCHLEVEL): > > Compiler: SUN CC 5.6 ^^^^^^^^^^^^^^^^^^^^^^^^ I don't think the DOC group supports this compiler anymore.. More particularly this compiler is buggy and you may land up with unresolved symbols even if you get past this part. My $0.02. Thanks Bala > > Make: GNU make 3.80 > > > > CONTENTS OF $ACE_ROOT/ace/config.h [if you use a link to a > > platform- > > specific file, simply state which one]: > > #include "ace/config-sunos5.9.h" > > > > CONTENTS OF $ACE_ROOT/include/makeinclude/platform_macros.GNU > > (unless > > this isn't used in this case, e.g., with Microsoft Visual C++): > > include $(ACE_ROOT)/include/makeinclude/platform_sunos5_sunc++.GNU > > > > > > CONTENTS OF $ACE_ROOT/bin/MakeProjectCreator/config/default.features > > (used by MPC when you generate your own makefiles): > > > > AREA/CLASS/EXAMPLE AFFECTED: > > [What example failed? What module failed to compile?] > > "ace/OS_NS_sys_stat.cpp" > > > > DOES THE ...

RE: [ace-users]: ACE 5.4.2 and ACE 5.4.3 compile failed on Solaris 9 x86 and Solaris 10 x86 #2
> Ok. Steve, could you maybe make clear with the build names > which builds use explicit templates? I'll try to get this clarified. > Explicit templates in TAO are known to be broken at this > moment. None of the tests at Riverace try to build TAO. -Steve ...

Re: [ace-users]: ACE 5.4.2 and ACE 5.4.3 compile failed on Solaris 9 x86 and Solaris 10 x86 #2
Hi Jin, Thanks for using the PRF. >> ACE VERSION: 5.4.3 >> >> HOST MACHINE and OPERATING SYSTEM: >> Solaris 10 x86 >> >> TARGET MACHINE and OPERATING SYSTEM, if different from HOST: >> COMPILER NAME AND VERSION (AND PATCHLEVEL): >> Sun Studio 9 (Sun CC 5.6) As we've mentioned several times now, we don't have this compiler installed yet on this hardware platform, so if you want things to be fixed soon I recommend you figure out what's going wrong and send us the patches. Otherwise, please contact one of the companies that provides commercial support for ACE at http://www.cs.wustl.edu/~schmidt/commercial-support.html Thanks, Doug >> CONTENTS OF $ACE_ROOT/ace/config.h [if you use a link to a >> platform- >> specific file, simply state which one]: >> >> #define ACE_HAS_STANDARD_CPP_LIBRARY 1 >> #define ACE_USES_STD_NAMESPACE_FOR_STDCPP_LIB 1 >> >> #include "ace/config-sunos5.9.h" >> >> >> CONTENTS OF $ACE_ROOT/include/makeinclude/platform_macros.GNU >> (unless >> this isn't used in this case, e.g., with Microsoft Visual C++): >> >> templates = implicit >> include $(ACE_ROOT)/include/makeinclude/platform_sunos5_sunc++.GNU >> >> >> CONTENTS OF $ACE_ROOT/bin/MakeP...

Re: [ace-users] [ACE 5.5] Upgrade from ACE 5.4.7 to ACE 5.5 #2
Hi Ishay, >> Sorry, we are using DevStudio 7.1 (2003) We use this too. Please see ACE_ROOT/tests/Time_Value_Test.cpp for lots of examples that use ACE_Time_Value with integers. Please see if this works on your OS/compiler platform. Thanks, Doug >> ~ Ishay >> >> Software Architect >> Onigma Ltd. >> Tel: +972-3-6877315 >> Fax: +972-3-6877128 >> Mobile: +972-54-2325090 >> Email: ishay@onigma.com >> >> -----Original Message----- >> From: Johnny Willemsen [mailto:jwillemsen@remedy.nl] >> Sent: Tuesday, March 07, 2006 2:42 PM >> To: 'Ishay Green'; ace-users@cs.wustl.edu >> Subject: RE: [ace-users] [ACE 5.5] Upgrade from ACE 5.4.7 to ACE 5.5 >> >> Hi, >> >> > ACE VERSION: 5.5 >> >> Thanks for using the PRF form. >> >> > HOST MACHINE and OPERATING SYSTEM: >> > >> > Intel, WindowsXp, Windows 2003 >> >> An important bit information is missing, which compiler did you use. >> >> > AREA/CLASS/EXAMPLE AFFECTED: >> > The only problem we encountered was a compilation error >> > when construction ACE_Time_Value. >> > >> > The ACE_Time_Value cannot be constructed anymore from an integer. >> > >> > For example: ACE_Time_Value( 5 ) --> Compile error >>...

RE: [ace-users] [ACE 5.5] Upgrade from ACE 5.4.7 to ACE 5.5 #2
Hi, Sorry, we are using DevStudio 7.1 (2003) ~ Ishay Software Architect Onigma Ltd. Tel: +972-3-6877315 Fax: +972-3-6877128 Mobile: +972-54-2325090 Email: ishay@onigma.com -----Original Message----- From: Johnny Willemsen [mailto:jwillemsen@remedy.nl] Sent: Tuesday, March 07, 2006 2:42 PM To: 'Ishay Green'; ace-users@cs.wustl.edu Subject: RE: [ace-users] [ACE 5.5] Upgrade from ACE 5.4.7 to ACE 5.5 Hi, > ACE VERSION: 5.5 Thanks for using the PRF form. > HOST MACHINE and OPERATING SYSTEM: > > Intel, WindowsXp, Windows 2003 An important bit information is missing, which compiler did you use. > AREA/CLASS/EXAMPLE AFFECTED: > The only problem we encountered was a compilation error > when construction ACE_Time_Value. > > The ACE_Time_Value cannot be constructed anymore from an integer. > > For example: ACE_Time_Value( 5 ) --> Compile error Great to hear things work without problems. This errors sounds strange, we do have test cases like this in tests/Time_Value_Test.cpp. We do have made all constructors of ACE_Time_Value explicit. As a result if you have a method that expects a ACE_Time_Value&, you just can't pass for example 5, you have to pass an ACE_Time_Value(5). Regards, Johnny Willemsen Remedy IT Postbus 101 2650 AC Berkel en Rodenrijs The Netherlands www.theaceorb.nl / www.remedy.nl ...

Re: [ace-users] compiling issue on Sun 5.8 with ACE 5.3
Hi, Please use the PRF form, that makes it much easier to answer you questions. I have seen this happen when you build with exceptions disabled. Do you use the ACE makefile structure, if yes, make sure exceptions=1. Somewhere in the compiler options it should say -DACE_HAS_EXCEPTIONS Regards, Johnny Willemsen Remedy IT BV Leeghwaterstraat 25 2811 DT Reeuwijk The Netherlands www.theaceorb.nl / www.remedy.nl "Manish Jain" <mjain@itangel.com> wrote in message news:<015601c345f3$85418920$5ec809c0@angels.com>... > Getting the following error while compiling the code wi...

[ace-users]: ACE 5.4.2 and ACE 5.4.3 compile failed on Solaris 9 x86 and Solaris 10 x86 #2
Hi,all I rebuild the ACE package according the instruction above,but get the same result. my platform_macros.GNU file has the following lines: templates = implicit include $(ACE_ROOT)/include/makeinclude/platform_sunos5_sunc++.GNU When i rebuild the ACE library,get the following compile errors: $ make inline=0 -j 2 -k -f GNUmakefile.ACE .... .... CC -mt -g -DSUN_CC_HAS_PVFC_BUG -I/export/home/hua/DevTools/ACE_wrappers -DACE_HAS_EXCEPTIONS -DACE_NO_INLINE -I.. -DACE_HAS_ACE_TOKEN -DACE_HAS_ACE_SVCCONF -DACE_BUILD_DLL -c -KPIC -o .shobj/OS_NS_sys_stat.o OS_NS_sys_stat.cpp "/export/home/hua/DevTools/ACE_wrappers/ace/OS_NS_sys_stat.inl", line 37: Error: fstat(int, stat*) is not a member of ACE_OS. "/export/home/hua/DevTools/ACE_wrappers/ace/OS_NS_sys_stat.inl", line 120: Error: fstat is not a member of ACE_OS. "/export/home/hua/DevTools/ACE_wrappers/ace/OS_NS_sys_stat.inl", line 142: Error: "ACE_OS::lstat(const char*, stat*)" was previously declared "ACE_OS::lstat(const wchar_t*, stat*)". "/export/home/hua/DevTools/ACE_wrappers/ace/OS_NS_sys_stat.inl", line 163: Error: Formal argument file of type const wchar_t* in call to ACE_OS::lstat(const wchar_t*, stat*) is being passed char*. 4 Error(s) detected. CC -mt -g -DSUN_CC_HAS_PVFC_BUG -I/export/home/hua/DevTools/ACE_wrappers -DACE_HAS_EXCEPTIONS -DACE_NO_INLINE -I.. -DACE_HAS_ACE_TOKEN -DACE_HAS_ACE_SVCCONF -DACE_BUILD_...

[ace-users]: ACE 5.4.2 and ACE 5.4.3 compile failed on Solaris 9 x86 and Solaris 10 x86 #2
Hi, ACE VERSION: 5.4.3 HOST MACHINE and OPERATING SYSTEM: Solaris 10 x86 TARGET MACHINE and OPERATING SYSTEM, if different from HOST: COMPILER NAME AND VERSION (AND PATCHLEVEL): Sun Studio 9 (Sun CC 5.6) CONTENTS OF $ACE_ROOT/ace/config.h [if you use a link to a platform- specific file, simply state which one]: #define ACE_HAS_STANDARD_CPP_LIBRARY 1 #define ACE_USES_STD_NAMESPACE_FOR_STDCPP_LIB 1 #include "ace/config-sunos5.9.h" CONTENTS OF $ACE_ROOT/include/makeinclude/platform_macros.GNU (unless this isn't used in this case, e.g., with Microsoft Visual C++): templates = implicit include $(ACE_ROOT)/include/makeinclude/platform_sunos5_sunc++.GNU CONTENTS OF $ACE_ROOT/bin/MakeProjectCreator/config/default.features (used by MPC when you generate your own makefiles): AREA/CLASS/EXAMPLE AFFECTED: [What example failed? What module failed to compile?] ACE library compile failed. DOES THE PROBLEM AFFECT: COMPILATION? Yes LINKING? Yes On Unix systems, did you run make realclean first? Yes EXECUTION? Yes OTHER (please specify)? [Please indicate whether ACE, your application, or both are affected.] SYNOPSIS: [Brief description of the problem] Some files still failed to compiled.The comiler pointed out that fstat and uname is not a member of ACE_OS. DESCRIPTION: [Det...

Re: [ace-users] Cannot compile ACE 5.5.8 on FreeBSD 6.2
Hi, It looks that you are using the configure way of building, try the traditional way of compiling as descirbed in ACE-INSTALL.html Regards, Johnny Willemsen Remedy IT Postbus 101 2650 AC Berkel en Rodenrijs The Netherlands www.theaceorb.nl / www.remedy.nl *** Integrated compile and test statistics see http://remedy.nl *** *** Commercial service and support for ACE/TAO/CIAO *** *** See http://www.theaceorb.nl/en/support.html *** "Bjoern" <bjoern.d.rasmussen@gmail.com> wrote in message news:<1178669822.203934.72920@e65g2000hsc.googlegroups.com>... > ACE VERSION: 5.5.8 > > HOST MACHINE and OPERATING SYSTEM: > > AMD64 with FreeBSD 6.2 > > COMPILER NAME AND VERSION (AND PATCHLEVEL): > > g++ (GCC) 3.4.6 [FreeBSD] 20060305 > > config.h in the bottom of this post. > > CONTENTS OF $ACE_ROOT/bin/MakeProjectCreator/config/default.features > > Doesn't exist > > AREA/CLASS/EXAMPLE AFFECTED: > > ../../ace/OS_NS_signal.inl: In function `int > ACE_OS::pthread_sigmask(int, const sigset_t*, sigset_t*)': > ../../ace/OS_NS_signal.inl:31: error: `::pthread_sigmask' has not been > declared > *** Error code 1 > > DOES THE PROBLEM AFFECT: > COMPILATION? > Yes > SYNOPSIS: > Ran ./configure --enable-shared=yes --enable-static=yes --prefix=/ > home/tt/ACE > > ...

Re: [tao-users] ACE 5.3.5 + TAO 1.3.5 + CIAO 0.3.5 beta released #2 #2
Hi Alex, > What are OCI's plan's for a supported TAO 1.4 release and developer > guide? Will this effect the release of the 1.3 guide? This is an excellent question - I'm sure Malcolm Spence will pitch in when he has a chance and I suspect that OCI will be supporting TAO 1.4 in due time. None of the changes in TAO 1.4 should affect the relevance of the info in the TAO 1.3 developer's guide - there's just more new stuff to document as time permits. Take care, Doug ...

Re: [ace-bugs] Linking to a shared ace 5.2 lib, compiled with g++ 3.2.3: Linker Error galore when trying to link to the built ace lib
Hi, Thanks for using the PRF. >> ACE VERSION: 5.2 I have several recommendations: .. Upgrade to ACE 5.3.3, which you can download from http://deuce.doc.wustl.edu/Download.html .. Build the ACE tests and examples directories to make sure they work. Assuming they work, then follow EXACTLY the same linker steps for your application. Thanks, Doug >> HOST MACHINE and OPERATING SYSTEM: Sparc Architecture and Solaris 2.6 >> TARGET MACHINE and OPERATING SYSTEM, if different from HOST: >> COMPILER NAME AND VERSION (AND PATCHLEVEL):...

[ace-bug] Compile ACE 5.4 on AIX 5.2 with gcc 3.3.2
Failed to build ACE 5.4 on AIX 5.2 with gcc3.3.2 Used config-aix5.1.h and platform_aix_g++.GNU I failed with ACE5.1, 5.3 too, so I tried 5.4. Does anybody know IF it works ? Could it help to build my own AIX5.2 gcc ? (my gcc 3.3.2 is binary AIX 5.1 but it worked fine for Non-ACE- applications) Do I have to use IBM Visual C++ Compiler ? Any suggestions would be helpful. ACE VERSION: 5.4 HOST MACHINE and OPERATING SYSTEM: RS/6000, 32-bit-kernel mode, AIX5.2 TARGET MACHINE and OPERATING SYSTEM, if different from HOST: COMPILER NAME AND VERSION (AND PATCHLEVEL): ...

RE: [ace-users] Re: [ace] compile error in mingw 3.2-rc1 (or w32api-3.2) #2
Hi, Please upgrade your mingw version to 3.7. This has been released today and contains the following fix below, they removed all defines which are just there to fool people. Your problems with MinGW should be gone now. Johnny 2005-01-13 Earnie Boyd <earnie@users.sf.net> * include/sys/stat.h (_S_IFLNK, S_IFLNK, _S_ISLNK, S_ISLNK, _lstat, lstat): Remove. * include/errno.h (ELOOP): Ditto. * include/_mingw.h: Increment version to 3.7. * Makefile.in: Ditto. > -----Original Message----- > From: owner-ace-users@cse.wustl.edu > [mailto:owner-ace-users@cse.wustl.edu] On Behalf Of Johnny Willemsen > Sent: maandag 10 januari 2005 19:11 > To: redwiki.net@gmail.com > Cc: ace-users@cs.wustl.edu > Subject: Re: [ace-users] Re: [ace] compile error in mingw > 3.2-rc1 (or w32api-3.2) > > Hi, > > > oh. sorry. I just use ACE at studying. so I don't interested in > > commercial support. (bad english. sorry. -_-) > > No problem with the English. Good that you are looking at > ACE, it is very > powerful, only the bad thing is you are using a new MinGW > version that cause > problems. > > > furthermore, I found cause about this error. it's placed in new > > w32api's sys/stat.h. it define lstat as stat, so this make all > > "lstat"s in ACE sources replace "stat". -_-a > > > > I tryed two modification (sorry ...

Re: [ace-users] Re: [ace] compile error in mingw 3.2-rc1 (or w32api-3.2) #2
Hi, > oh. sorry. I just use ACE at studying. so I don't interested in > commercial support. (bad english. sorry. -_-) No problem with the English. Good that you are looking at ACE, it is very powerful, only the bad thing is you are using a new MinGW version that cause problems. > furthermore, I found cause about this error. it's placed in new > w32api's sys/stat.h. it define lstat as stat, so this make all > "lstat"s in ACE sources replace "stat". -_-a > > I tryed two modification (sorry for handy patch..) > 1. ace/config-win32-mingw.h, line 85 : insert below code > #define ACE_LACKS_LSTAT That is not a nice solution. > 2. ace/os_include/sys/os_stat.h, line 44 : insert below code > #if defined (__MINGW__) && (__MINGW32_MAJOR_VERSION >= 3) && > (__MINGW32_MINOR_VERSION >= 6) > #undef lstat > #undef _lstat > #endif > > it's okey. except ace/Name_Space.cpp, all code is compiled > successfully. ^_^ check this please. Ok. This should do the trick. But I have taken first another step, I have send an e-mail to the MinGW users mailing list to ask if the MinGW people can change this. They should make a normal function for lstat and handle the redirection to stat internally. Until the time being, you can use the workaround. What is the problem in ace/Name_Space.cpp? Johnny ...

[ace-users] ACE-5.5.2: ACE doesn't compile out of the box in Solaris 10 with Sun Pro tools
--0-1143332205-1158583760=:84584 Content-Type: text/plain; charset=iso-8859-1 Content-Transfer-Encoding: 8bit Hi, I have had a few problems to build ACE 5.5.2 on Solaris with the autoconf procedure. If you have a similar environment and is having problems, make sure you take a look at the diffs below. They worked for me. -- Douglas ACE VERSION: 5.5.2 HOST MACHINE and OPERATING SYSTEM: SunOS 5.10 Generic_118855-15 i86pc i386 i86pc TARGET MACHINE and OPERATING SYSTEM, if different from HOST: same as host COMPILER NAME AND VERSION (AND PATCHLEVEL): cc: Sun C 5.8 Patch 121016-03 2006/06/07 CC: Sun C++ 5.8 Patch 121018-04 2006/08/02 Sun make THE $ACE_ROOT/ace/config.h FILE: built with autoconf THE $ACE_ROOT/include/makeinclude/platform_macros.GNU FILE: built with autoconf CONTENTS OF $ACE_ROOT/bin/MakeProjectCreator/config/default.features (used by MPC when you generate your own makefiles): built with autoconf AREA/CLASS/EXAMPLE AFFECTED: see diffs below DOES THE PROBLEM AFFECT: Compilation/Linking of ACE itself SYNOPSIS: ACE doesn't compile out of the box in Solaris 10 with SunPro tools. DESCRIPTION: The default autoconf build for ACE-5.5.2 fails in Solaris in 3 points. After detailed examination of the compilation errors, I found that some includes seemed to be missing (refer to the diffs below). Also the Solaris native perl fails to include PerlACE. I believe it ...

Re: [ace-users] compile ace-5.5.7 error on redhat enterprise linux 5 #2
Hi, I don't think an older release will also not work. This is a new OS with a new compiler, I would expect the define to work, but strangely it doesn't work. Regards, Johnny Willemsen Remedy IT Postbus 101 2650 AC Berkel en Rodenrijs The Netherlands www.theaceorb.nl / www.remedy.nl "Zhang Liming" <xphenix.cn@gmail.com> wrote in message news:<f06r86$e2o$1@news.yaako.com>... > Johnny Willemsen ??: > > Hi, > > > >> thanks for your advice, but I'm very sorry to say that it still not > >> work ,I got the same errors as I described earlier. > > > > Have you done a full rebuild of the ACE library? > > > > johnny > > > Surely I did. Maybe I should try the older release.... > > This is a multi-part message in MIME format. --------------040607020902010404080705 Content-Type: text/plain; charset=GB2312 Content-Transfer-Encoding: 8bit Johnny Willemsen �: > Hi, > > I don't think an older release will also not work. This is a new OS with a > new compiler, I would expect the define to work, but strangely it doesn't > work. > > Regards, > > Johnny Willemsen > Remedy IT > Postbus 101 > 2650 AC Berkel en Rodenrijs > The Netherlands > www.theaceorb.nl / www.remedy.nl > > > "Zhang Liming" <xphenix.cn@gmail.com> wrote in message > n...

Re: Subject: Building ACE 5.3.1 on Mac OS X (Tiger) 10.4.2 was [ace-users] Building ACE on Mac OSX 10.4 #2
Hi Jason, >> I know it isn't the most recent version available, but this version >> is used extensively across the corporation. Changing the version of >> ACE all these products used will cause the architect's heads to >> explode ;) >> >> Is it your opinion that 5.3.1 is hopeless cause on Tiger? It'll take some work, but companies like Riverace, Remedy, and OCI can help out with this stuff if staying with 5.3.1 is essential. Please see http://www.cs.wustl.edu/~schmidt/commercial-support.html for help with this stuff. >> > http://cvs.doc.wustl.edu/ >> I will try it out, and let you know how it works. Great - if there are any problems please let us know quickly so that we can get the fixes into the x.4.8 beta. Thanks, Doug -- Dr. Douglas C. Schmidt Professor and Associate Chair Electrical Engineering and Computer Science TEL: (615) 343-8197 Institute for Software Integrated Systems WEB: www.dre.vanderbilt.edu/~schmidt Vanderbilt University, Nashville TN, 37203 NET: d.schmidt@vanderbilt.edu ...

[ace-users] RE: [ace] compile error in mingw 3.2-rc1 (or w32api-3.2) #2
Hi, > I tried to compile with newly released Mingw-runtime 3.7, and it > finished successfully. thanks for your concern about this problem. Thanks for the confirmation. Regards, Johnny Willemsen Remedy IT Leeghwaterstraat 25 2811 DT Reeuwijk The Netherlands www.theaceorb.nl / www.remedy.nl ...

RE: [ace-users] Problem compiling application with ACE 5.4.2 #2
Hi, > Fair enough - is there a schedule or hoped-for date when 5.4.3 will be > available?? This month, before Xmas. > Also - after building the library, I ran into the same problem with my > application - it tells me that closesocket is not a member of the ACE > namespace. I'll play around with adding the include files to > get rid of > that. The workaround I had was to undefine the ACE_HAS_INLINED_OSCALLS > and I don't like that - feels like a real kludge... Maybe you have to add some includes. If you have fixes, share them with the mailing lists. Johnny ...

RE: [ace-users] Problem compiling application with ACE 5.4.2 #2
Hi Neil, We run Solaris 8, Sun CC 5.3 regularly and don't see this problem. But we don't use STLport... Maybe that's a factor. We can do support for you at 5.4b (available at Riverace's web site). For other versions, please contact me. Thanks, -Steve -- Steve Huston, Riverace Corporation Adding Service to Open Source Software ACE book info at http://www.riverace.com/acebooks/ > -----Original Message----- > From: owner-ace-users@cse.wustl.edu > [mailto:owner-ace-users@cse.wustl.edu] On Behalf Of Neil B. Cohen > Sent: Tuesday, November 30, 2004 1:19 PM > To: ace-users@cs.wustl.edu > Subject: [ace-users] Problem compiling application with ACE 5.4.2 > > > Just an FYI followup to my question from earlier today... > > As per the advice I got this morning, I tried downloading 5.4.2 and > compiling that. I am using the Sun CC 5.3 compiler, which the > documentation says has problems (and don't I know that... :)) But the > optimized version of ACE compiled, while the debug version failed to > compile at all - I never did get to my application this time. > Same type > of error though - I got this output: > > gmake[1]: Entering directory `/auto/vsc- > tools/ACE/ACE.5.4.2/ACE_wrappers/build_Sol8_dbg/ace' > gmake[2]: Entering directory `/auto/vsc- > tools/ACE/ACE.5.4.2/ACE_wr...

Web resources about - RE: [ace-users] compiling issue on Sun 5.8 with ACE 5.3 #2 #2 - comp.soft-sys.ace

Samsung Galaxy Ace 4 User Reviews
Samsung Galaxy Ace 4 reviews written by Phone Arena users. You can read the opinion of each user and how they rate the phone in 11 categories. ...

Samsung Galaxy Ace 3 official: iPhone-alike size for the new user
Samsung has revealed another in its Galaxy series, the Galaxy Ace 3, now targeting entry-level smartphone users who want a pocket-friendly 4-inch ...

MapR whips out a pack of ACEs, eyes up containing Docker users
Containers aren't persistent. Our thingy is, promises firm MapR has announced new security enhancements for its big data customers, as well ...

Resources last updated: 3/22/2016 12:04:18 AM